program: Gaussian 09
title: 000219784
version: EM64L-G09RevD.01
frameworkgroup: C1[X(C8H11N5O)]
method: RPBEPBE
basis: SDD
operation: Freq
keyword: #p
keyword: freq=noraman
keyword: PBEPBE/SDD
title: #p freq=noraman PBEPBE/SDD
converged: YES YES NO NO
title: Mulliken charges:
elementType: O N N N N N C C C C C C C C H H H H H H H H H H H
charge: -0.480620 -0.166725 -0.362398 -0.017799 -0.056819 -0.113508 0.024518 0.149011 0.228246 -0.353285 -0.416091 -0.317532 -0.612030 -0.358932 0.233596 0.263254 0.333681 0.260170 0.202459 0.211671 0.243788 0.244427 0.262300 0.241069 0.357549
chargesum: 0.00000
title: Mulliken charges with hydrogens summed into heavy atoms:
elementType: O N N N N N C C C C C C C C
charge: -0.123071 -0.166725 -0.028717 -0.017799 -0.056819 -0.113508 0.024518 0.149011 0.228246 0.143565 -0.155921 0.096597 0.138486 -0.117863
polarizability: 1.84451497e+02 -4.05446031e+00 1.34054018e+02 4.68646052e+00 1.95470848e+00 6.70586832e+01
1716.lowfreq: -5.3075 -4.8482 -0.0005 0.0002 0.0005 6.5035 27.8837 62.8343 84.1737
frequency: 27.8646 62.8336 84.1665 104.9845 121.0178 166.0117 176.3645 245.3416 254.2024 279.3614 285.5831 303.5018 363.5263 470.9052 517.9849 524.1361 543.3386 619.4955 630.0981 640.3320 666.8635 717.0497 735.9073 786.3825 827.3911 839.4014 870.2214 897.4040 933.5653 955.0004 1001.6002 1026.9423 1073.4288 1114.1559 1122.6172 1129.0158 1178.9384 1189.4750 1206.9665 1220.7215 1249.3387 1267.9583 1309.7965 1330.9230 1345.5142 1358.7088 1387.8970 1399.4838 1416.0897 1432.6499 1451.3328 1467.1047 1469.2771 1471.0913 1488.8980 1497.8666 1542.7072 1601.6528 2963.2128 2986.5164 3003.2127 3027.5388 3091.2493 3095.0579 3124.1655 3158.3184 3213.1844 3556.7683 3591.9085
redmass: 4.2977 3.9401 3.8536 1.2079 2.5272 4.2316 4.9538 4.6222 3.1828 1.4920 2.4387 4.8734 2.4629 4.2397 5.5844 3.3076 3.7682 2.0047 6.1982 1.9222 10.9955 4.8022 5.8602 3.2378 1.7718 2.7310 3.9993 3.6052 1.4337 2.8122 3.0778 3.2548 1.7842 2.2368 2.2805 1.3103 2.1741 1.5278 1.1640 2.2229 5.4490 1.2738 5.2022 2.7160 1.4876 3.4818 1.7625 1.4580 1.6851 1.8125 1.9277 1.0899 1.0439 1.0856 1.4330 2.9567 6.4531 6.2345 1.0554 1.0697 1.0331 1.1061 1.0954 1.1025 1.1016 1.0919 1.0974 1.0771 1.0668
irintensity: 1.8132 4.3017 4.5702 0.7974 3.1987 7.8653 0.5661 14.2055 8.3360 101.4415 50.7581 3.1766 21.2298 9.6714 2.2454 7.5552 7.7622 47.3897 25.6995 60.6975 5.4102 3.2350 17.2862 32.6366 13.0628 1.0040 46.5788 15.3532 9.9751 9.1251 2.3568 69.5368 21.9962 24.9937 19.2266 1.0466 7.9770 60.9472 3.5448 3.8681 36.4828 38.3334 45.7884 51.6391 95.4744 15.5407 9.6622 0.3361 8.4174 2.0636 83.8677 15.5239 15.7996 8.6367 8.9434 5.5734 127.7765 666.4480 69.3744 28.6009 52.6130 94.7968 8.0200 19.9348 3.2177 23.1424 2.3821 91.3110 6.4908
temp: 298.150 k
press: 1.00000 atm
elementType: 8 7 7 7 7 7 6 6 6 6 6 6 6 6 1 1 1 1 1 1 1 1 1 1 1
symmnumber: 1
zpe: 515671.4 jmol-1
zpe.correction: 0.196409 hartree
zpe.thermalcorrener: 0.209371 hartree
zpe.thermalcorrenthalpy: 0.210315 hartree
zpe.thermalcorrgfe: 0.155843 hartree
zpe.sumelectzpe: -659.377180 hartree
zpe.sumelectthermal: -659.364218 hartree
zpe.sumelectthermalent: -659.363274 hartree
zpe.sumelectthermalfe: -659.417746 hartree
dipole: -3.6040 -1.0302 1.3061
dipole: 3.9694
quadrupole: -59.4165 -86.9036 -82.4038
quadrupole: 3.5939 -5.9318 -1.8431
quadrupole: 16.8248 -10.6623 -6.1625 3.5939 -5.9318 -1.8431
hfenergy: -659.5735893 hartree
pointgroup: C01 [X(C8H11N5O1)]
dipole: -1.4116009 -0.4371752 0.505079 debye
dipolederiv: -0.5497795 -0.0403213 -0.2078772 -0.1458466 -0.7729473 -0.0542678 -0.2422656 -0.0930076 -0.3662665 -0.4821572 0.2172112 -0.0060642 -0.1849682 -0.3094162 -0.0358032 -0.0492313 0.0012241 -0.1202084 -1.6675188 -0.196648 -0.0362122 -0.5591755 -0.3120647 0.0063059 -0.0104492 0.0150976 -0.4732607 -0.2456172 0.2271687 0.0253632 0.5590359 -0.1696623 0.0453389 0.0505153 0.0225811 -0.1973829 -0.8571299 0.1277245 -0.0307125 0.2291898 -0.7029889 -0.0250893 -0.030584 -0.0382766 -0.2075378 -1.0009389 -0.0645719 -0.0514774 -0.817035 -0.7299697 -0.083111 -0.1284851 -0.0470864 -0.2503462 -0.8844329 -0.0432108 -0.0556815 0.1231551 -0.2229755 -0.0143849 -0.0748273 -0.0250411 -0.0138413 0.5910005 -0.2998799 0.0057598 -0.2298942 0.4871334 0.0144243 0.0188001 0.0096656 0.0897674 1.9791327 0.2479182 0.119679 0.8851722 0.6468298 0.0793985 0.2399992 0.0696101 0.2280397 0.6084002 -0.1148038 0.070533 -0.4331885 0.0518803 -0.0430451 0.0260189 -0.0195017 0.2669616 -0.0757588 -0.0709085 -0.0052802 -0.1497838 0.2635298 0.031927 -0.0091982 0.0312706 -0.115756 0.3659718 0.0717434 0.1048123 0.1782348 0.6648394 0.0887147 0.0582946 0.0638455 0.2857629 0.5928359 -0.0634091 0.0235794 0.0747959 0.0517452 -0.0100287 0.0408714 -0.0206183 0.2105387 1.1498115 -0.0459685 0.0848491 0.164362 0.5800403 0.0671368 0.1206111 0.0562064 -0.0506586 -0.1389562 0.0178536 -0.0588174 0.0869869 0.1050059 -0.0040725 -0.1113923 0.0394285 -0.1268847 0.1651172 -0.0386788 -0.0075648 0.0687592 0.0123334 -0.0324246 0.0276827 -0.0392788 0.08978 0.2473609 0.064249 -0.0340886 0.1898017 0.1593162 -0.0100452 -0.0490482 -0.0078268 0.3220354 0.0437964 -0.0671843 -0.0182824 -0.0391847 0.0047807 -0.0190575 -0.0155874 -0.0213304 0.1672865 -0.2346685 0.113869 0.0018431 0.0604732 -0.0768057 -0.0216853 -0.022903 -0.0047976 0.0721008 0.0739952 -0.0184623 -0.0957484 -0.0375542 -0.0294895 -0.001084 -0.0486586 -0.0478129 -0.1833886 -0.0329414 0.0184246 -0.0393861 0.0688573 0.0673654 0.1019764 -0.112626 0.0832887 -0.0424789 -0.0599471 0.0222931 0.0448421 0.0606217 0.0969509 -0.0665756 0.1241655 -0.0550806 -0.0445232 0.1156834 0.0176225 -0.0002039 -0.0797537 -0.0169208 -0.0206622 -0.009103 -0.0127602 0.1291369 0.079512 -0.0009514 -0.0024788 -0.0191142 -0.1067107 -0.022289 -0.0077058 -0.0212037 0.1178821 0.2172288 -0.0810791 0.1686146 -0.0539469 0.2582007 0.0284035 0.2151065 0.0614044 0.2132418 unknown
polarizability: 184.5651095|-3.6830032|133.7588942|4.0420741|4.3229321|67.2401949 unknown
InChI: InChI=1S/C8H11N5O/c1-13-8-6(4-12-13)7(9-2-3-14)10-5-11-8/h4-5,9,14H,2-3H2,1H3
charge 0 multiplicity 1
25 atoms
O  -4.345167 -1.515875 0.076215
N  2.73737 -0.67172 0.036881
N  -1.94177 -0.224317 -0.323725
N  2.243168 -1.972132 -0.130808
N  1.845462 1.621532 0.180641
N  -0.602887 1.697856 -0.023684
C  0.496991 -0.461606 -0.135659
C  1.719259 0.264076 0.039199
C  -0.700291 0.333616 -0.163551
C  -3.194391 0.538743 -0.355266
C  0.890134 -1.836601 -0.234555
C  -4.231222 -0.121687 0.555553
C  4.17008 -0.429224 0.18321
C  0.640477 2.252257 0.138495
H  -3.593613 0.575337 -1.388246
H  -2.972445 1.568671 -0.031875
H  -2.036808 -1.238337 -0.407022
H  0.285896 -2.731786 -0.374681
H  -5.200615 0.409939 0.467069
H  -3.888381 -0.097256 1.610087
H  4.559121 -0.954078 1.071798
H  4.711933 -0.7832 -0.709767
H  4.313588 0.656381 0.299674
H  0.660043 3.341306 0.246032
H  -4.982331 -2.020295 0.639085
