program: Gaussian 09
title: 000219779
version: EM64L-G09RevD.01
frameworkgroup: C1[X(C12H10ClN5)]
method: RPBEPBE
basis: SDD
operation: Freq
keyword: #p
keyword: freq=noraman
keyword: PBEPBE/SDD
title: #p freq=noraman PBEPBE/SDD
converged: NO YES NO NO
title: Mulliken charges:
elementType: Cl N N N N N C C C C C C C C C C C C H H H H H H H H H H
charge: -0.064097 -0.166402 -0.449507 -0.007622 -0.040290 -0.118842 -0.004894 0.149722 0.231250 -0.416679 0.484809 -0.608725 -0.270016 -0.476892 -0.347899 -0.091458 -0.177526 -0.275128 0.257516 0.318314 0.248183 0.248162 0.263747 0.348019 0.224103 0.250243 0.233109 0.258799
chargesum: 0.00000
title: Mulliken charges with hydrogens summed into heavy atoms:
elementType: Cl N N N N N C C C C C C C C C C C C
charge: -0.064097 -0.166402 -0.131194 -0.007622 -0.040290 -0.118842 -0.004894 0.149722 0.231250 -0.159162 0.484809 0.151368 0.078003 -0.252789 -0.097656 -0.091458 0.055583 -0.016329
polarizability: 3.09745049e+02 4.32220654e+00 1.91855027e+02 5.67067240e-03 9.61827114e-03 7.05836203e+01
1716.lowfreq: -7.2773 -3.7477 0.0012 0.0019 0.0024 6.2881 30.3738 43.6602 71.8427
frequency: 30.2899 43.6033 71.8422 93.8416 111.9205 149.5982 175.5592 182.8555 222.3392 251.3705 265.0947 274.0087 306.3085 337.8404 387.9922 441.5632 497.3389 522.7281 544.1710 559.6536 564.2563 615.4925 629.7695 644.6420 671.8547 676.0431 684.6709 730.2753 765.5575 779.4622 785.6817 821.3832 858.3353 878.4835 881.9261 932.6824 935.7127 956.1407 962.9732 979.6515 1018.1720 1070.4050 1091.0840 1126.2553 1129.1376 1177.6756 1180.5010 1214.7072 1227.2210 1257.8413 1279.2268 1296.3882 1332.9611 1355.0126 1367.1819 1396.8161 1414.7633 1428.2491 1438.4603 1455.9175 1467.8052 1470.9757 1489.5253 1515.2660 1537.5326 1569.7232 1605.5196 1611.8450 3007.7232 3102.0567 3117.5586 3127.7329 3153.2323 3168.3424 3179.5673 3184.4404 3210.2199 3538.0840
redmass: 7.8702 4.4690 7.8983 1.1515 3.0133 8.1397 5.1795 5.3995 4.5606 3.7762 6.1968 5.4545 5.2846 4.8949 11.6798 3.1272 5.5499 6.8524 3.2971 3.8018 6.8008 1.7387 4.3717 7.4072 5.3248 7.4429 2.1095 7.0010 7.6635 1.5439 2.5888 2.0452 7.0530 1.4083 6.9020 1.4252 1.3724 2.9228 1.3331 6.0951 4.1002 1.9670 1.6155 3.1084 1.3119 1.9435 1.2057 2.2336 3.2463 3.4510 1.5020 5.1508 4.1831 3.0682 3.0788 2.9948 2.1871 2.0294 2.7042 1.9646 1.0425 2.3173 1.4163 3.2371 6.8585 7.2891 3.0754 5.9728 1.0329 1.1027 1.0893 1.1019 1.0918 1.0925 1.0974 1.0942 1.0972 1.0756
irintensity: 0.0006 0.4254 0.0031 0.2208 1.4979 1.0118 0.0048 2.0451 5.3913 3.8198 4.5135 2.6947 2.0390 2.0004 6.4208 8.8730 1.6048 5.4363 11.3919 2.6967 2.4243 24.4476 4.2879 14.6278 10.2072 43.1997 32.6560 34.9267 1.9279 59.7778 52.4881 10.8382 46.6750 0.8326 2.2560 25.1799 15.6390 24.0636 0.2860 7.6541 55.0440 15.9675 4.3751 5.8949 1.0149 17.6526 8.0260 10.6444 1.4521 19.5275 12.2824 63.1815 55.6910 15.7928 17.2822 36.5173 22.0631 51.5594 57.3851 48.1000 17.0508 177.8686 120.7607 7.3056 449.3481 424.6677 425.2508 24.1535 50.4162 16.7922 12.5969 2.9600 13.0444 14.3436 3.4209 34.9130 2.1757 21.3133
temp: 298.150 k
press: 1.00000 atm
elementType: 17 7 7 7 7 7 6 6 6 6 6 6 6 6 6 6 6 6 1 1 1 1 1 1 1 1 1 1
symmnumber: 1
zpe: 541549.7 jmol-1
zpe.correction: 0.206265 hartree
zpe.thermalcorrener: 0.221167 hartree
zpe.thermalcorrenthalpy: 0.222111 hartree
zpe.thermalcorrgfe: 0.162739 hartree
zpe.sumelectzpe: -1195.835083 hartree
zpe.sumelectthermal: -1195.820182 hartree
zpe.sumelectthermalent: -1195.819238 hartree
zpe.sumelectthermalfe: -1195.878610 hartree
dipole: -1.2893 3.4582 -0.0001
dipole: 3.6907
quadrupole: -106.6446 -104.6589 -115.2294
quadrupole: 13.1568 0.0070 -0.0035
quadrupole: 2.1997 4.1854 -6.3851 13.1568 0.0070 -0.0035
hfenergy: -1196.0413488 hartree
pointgroup: C01 [X(C12H10Cl1N5)]
dipole: 0.3964013 -1.3968336 -0.0131618 debye
polarizability: 309.5825006|-5.1399621|191.9199437|-4.7902703|0.5462965|70.681252 unknown
InChI: InChI=1S/C12H10ClN5/c1-18-12-10(6-16-18)11(14-7-15-12)17-9-4-2-3-8(13)5-9/h2-7,17H,1H3
charge 0 multiplicity 1
28 atoms
Cl -4.690314 2.395516 0.140487
N  4.07397 -0.239378 -0.043808
N  -0.576177 -0.90717 0.04331
N  3.875002 -1.624261 -0.044894
N  2.699523 1.804616 -0.010156
N  0.291487 1.325031 0.03465
C  1.836246 -0.540857 -0.002046
C  2.874095 0.446522 -0.018462
C  0.494097 -0.026998 0.025751
C  2.522703 -1.80004 -0.019614
C  -1.976443 -0.6752 0.072856
C  5.422477 0.324275 -0.068419
C  -2.552468 0.623726 0.08958
C  -2.818651 -1.823051 0.085958
C  1.387685 2.153878 0.016497
C  -3.952996 0.724455 0.119153
C  -4.218039 -1.674802 0.115726
C  -4.811783 -0.390805 0.132934
H  2.13603 -2.81833 -0.015726
H  -0.312206 -1.894737 0.034531
H  5.990286 -0.005897 0.817057
H  5.953997 0.002643 -0.979224
H  5.324689 1.420955 -0.061313
H  -1.900774 1.498411 0.079266
H  -2.377754 -2.827951 0.072974
H  1.167209 3.225137 0.024633
H  -4.857921 -2.563129 0.12572
H  -5.897472 -0.266162 0.155979
