program: Gaussian 09
title: 000219778
version: EM64L-G09RevD.01
frameworkgroup: C1[X(C13H13N5)]
method: RPBEPBE
basis: SDD
operation: Freq
keyword: #pfreq=noraman
keyword: PBEPBE/SDD
title: #p freq=noraman PBEPBE/SDD
converged: NO YES NO NO
title: Mulliken charges:
elementType: N N N N N C C C C C C C C C C C C C H H H H H H H H H H H H H
charge: -0.388123 -0.166461 -0.015951 -0.087102 -0.054875 0.024461 0.217770 0.151051 -0.458695 0.379211 -0.417639 -0.611420 -0.388565 -0.386322 -0.365113 -0.223604 -0.223582 -0.232525 0.243706 0.244787 0.328822 0.259342 0.244702 0.244690 0.262793 0.240699 0.241267 0.243437 0.230314 0.230306 0.232617
chargesum: 0.00000
title: Mulliken charges with hydrogens summed into heavy atoms:
elementType: N N N N N C C C C C C C C C C C C C
charge: -0.059301 -0.166461 -0.015951 -0.087102 -0.054875 0.024461 0.217770 0.151051 0.029799 0.379211 -0.158297 0.140766 -0.147866 -0.145055 -0.121676 0.006710 0.006724 0.000092
polarizability: 2.57042857e+02 1.19495365e+01 1.56264286e+02 6.18663605e-01 -2.36829261e-01 1.18966138e+02
1716.lowfreq: -24.4362 -3.5792 -0.0005 -0.0005 0.0002 4.3178 12.6382 24.2084 47.8040
frequency: -24.3047 23.9464 47.8036 65.1082 105.6124 134.5551 144.8218 174.5663 213.5909 246.9880 265.8037 298.6768 315.3944 340.7863 403.0313 458.8245 480.9679 516.7429 521.2158 546.2427 564.2638 617.5466 630.0405 636.0042 667.0435 703.7726 726.6835 737.9559 761.1665 785.2902 824.4285 832.5323 856.9775 880.2436 925.0969 934.4301 944.1192 953.0045 979.5596 982.1164 990.2980 998.6871 1026.8863 1087.1170 1091.6861 1128.6891 1129.3392 1173.7469 1179.2221 1187.7211 1202.0860 1213.3035 1219.4163 1249.5352 1304.5131 1319.0219 1324.8471 1332.3228 1354.8493 1383.2750 1385.4858 1414.9248 1432.7036 1438.8725 1447.0855 1469.3743 1479.7879 1484.0572 1488.6174 1493.5141 1539.6248 1592.9023 1593.9467 1615.5687 2997.2720 3004.6783 3044.8119 3096.9585 3120.9738 3122.0264 3125.8527 3135.4262 3148.1885 3160.4044 3164.7365 3212.0818 3572.7354
redmass: 3.7615 4.4185 5.3623 3.6937 1.1077 5.3449 3.4976 4.6282 5.6765 3.3383 6.4414 5.2067 2.2546 4.1132 2.7575 1.1427 4.5406 6.1564 4.9258 4.0647 4.4572 6.3420 5.3963 6.9425 11.2169 2.0281 4.8542 5.1345 2.0629 3.1265 1.8068 4.2731 1.2436 5.0567 1.5708 1.4428 1.6098 3.3372 1.3883 3.5673 6.2419 1.3241 2.2076 1.5271 5.1922 1.3102 3.0736 1.0538 2.3594 1.1172 1.1080 2.1825 2.3194 5.7774 4.2732 1.7998 1.2751 2.9512 3.5965 8.4445 1.7194 1.8211 1.8066 2.1781 1.9890 1.0431 1.8491 1.7040 1.3709 1.7894 6.4198 6.9973 6.0896 6.1567 1.0592 1.0330 1.1038 1.1026 1.0858 1.0885 1.1016 1.0915 1.0961 1.0920 1.1016 1.0974 1.0782
irintensity: 0.2510 0.1487 0.0869 2.8825 0.0018 0.4843 0.7265 0.2026 1.0958 9.1226 10.9874 0.2023 4.0052 1.0147 0.8295 67.0143 3.4975 8.0933 2.7919 1.5915 14.7897 0.1662 0.7141 26.4133 1.6045 42.0717 34.1922 8.9415 40.2975 27.9663 9.9891 8.7090 0.2647 19.2880 1.5435 8.7939 3.8970 19.4048 0.0343 1.7364 0.5006 0.4678 9.1313 8.2836 34.2630 0.9757 3.6889 0.0222 15.9026 1.5623 0.3314 7.1337 0.8755 34.4738 60.3075 27.5394 0.2895 99.2556 66.7507 0.0887 2.2405 29.3280 0.2650 8.6698 151.2829 16.1366 40.1588 9.8206 1.0902 7.6850 173.1594 699.0606 5.8428 7.9730 28.7033 53.0848 12.3526 19.1165 6.9731 2.3825 3.0725 12.2558 36.0057 23.3680 21.2292 2.4826 70.1095
temp: 298.150 k
press: 1.00000 atm
elementType: 7 7 7 7 7 6 6 6 6 6 6 6 6 6 6 6 6 6 1 1 1 1 1 1 1 1 1 1 1 1 1
symmnumber: 1
zpe: 639560.3 jmol-1
zpe.correction: 0.243596 hartree
zpe.thermalcorrener: 0.257925 hartree
zpe.thermalcorrenthalpy: 0.258869 hartree
zpe.thermalcorrgfe: 0.200820 hartree
zpe.sumelectzpe: -775.665062 hartree
zpe.sumelectthermal: -775.650733 hartree
zpe.sumelectthermalent: -775.649789 hartree
zpe.sumelectthermalfe: -775.707838 hartree
dipole: -2.8582 -1.4382 -0.0169
dipole: 3.1997
quadrupole: -91.3911 -112.2898 -100.5791
quadrupole: 4.1936 0.1292 -0.1664
quadrupole: 10.0289 -10.8698 0.8409 4.1936 0.1292 -0.1664
hfenergy: -775.9086577 hartree
pointgroup: C01 [X(C13H13N5)]
dipole: 1.130657 0.5534823 0.0015167 debye
polarizability: 257.2926775|10.8483549|155.9965855|-0.5276713|0.8295838|118.984018 unknown
InChI: InChI=1S/C13H13N5/c1-18-13-11(8-17-18)12(15-9-16-13)14-7-10-5-3-2-4-6-10/h2-6,8-9,14H,7H2,1H3
charge 0 multiplicity 1
31 atoms
N  0.551533 -0.171259 -0.014595
N  -4.028089 0.973238 0.014222
N  -3.338751 2.191189 0.021531
N  -1.075663 -1.869381 -0.021237
N  -3.494687 -1.432847 -0.007606
C  -1.835413 0.438712 0.000663
C  -0.772082 -0.528408 -0.011754
C  -3.160131 -0.104111 0.001713
C  1.649496 -1.166401 -0.027878
C  2.995109 -0.459341 -0.011135
C  -2.015336 1.861132 0.013224
C  -5.488518 0.937225 0.019911
C  3.644103 -0.114523 -1.224418
C  3.614358 -0.116007 1.218207
C  -2.398024 -2.23745 -0.018407
C  4.886631 0.559169 -1.211048
C  4.856603 0.557884 1.235818
C  5.495321 0.897492 0.020157
H  1.543775 -1.805186 -0.924316
H  1.536045 -1.834303 0.845966
H  0.801642 0.817909 -0.00988
H  -1.279228 2.66385 0.016949
H  -5.880598 1.433636 0.923153
H  -5.888044 1.446213 -0.873031
H  -5.793864 -0.120724 0.013699
H  3.177116 -0.382647 -2.180236
H  3.124426 -0.385687 2.16203
H  -2.586099 -3.315494 -0.026217
H  5.379903 0.814667 -2.155486
H  5.326783 0.812204 2.192287
H  6.460583 1.416049 0.032311
