program: Gaussian 09
title: 000219777
version: EM64L-G09RevD.01
frameworkgroup: C1[X(C12H10ClN5)]
method: RPBEPBE
basis: SDD
operation: Freq
keyword: #p
keyword: freq=noraman
keyword: PBEPBE/SDD
title: #p freq=noraman PBEPBE/SDD
converged: NO YES NO NO
title: Mulliken charges:
elementType: Cl N N N N N C C C C C C C C C C C C H H H H H H H H H H
charge: -0.060530 -0.166112 -0.443970 -0.007903 -0.041047 -0.118373 -0.006685 0.149370 0.229206 -0.416752 0.468683 -0.608895 -0.448797 -0.310974 -0.350038 -0.184802 -0.204396 -0.120689 0.257410 0.316370 0.248172 0.248128 0.263515 0.224673 0.326830 0.248014 0.255367 0.254223
chargesum: 0.00000
title: Mulliken charges with hydrogens summed into heavy atoms:
elementType: Cl N N N N N C C C C C C C C C C C C
charge: -0.060530 -0.166112 -0.127600 -0.007903 -0.041047 -0.118373 -0.006685 0.149370 0.229206 -0.159342 0.468683 0.150921 -0.224124 0.015856 -0.102023 0.070565 0.049827 -0.120689
polarizability: 3.41948692e+02 -1.73325666e+00 1.72442396e+02 1.37467357e-02 4.35933244e-02 7.03955417e+01
1716.lowfreq: -6.2646 -3.4078 -0.0015 0.0009 0.0022 4.4901 30.0374 47.5228 74.4356
frequency: 30.0370 47.4918 74.4345 87.2602 105.2799 150.6148 169.4710 178.2539 219.4278 255.9073 259.5790 296.6472 325.9992 334.9237 408.4940 413.4740 503.2639 503.3931 521.9846 544.2141 610.5237 611.1503 627.0591 629.8379 664.3787 670.6074 704.9669 730.5587 767.2080 785.3542 809.7076 811.7894 821.7724 849.9150 879.1562 932.1878 936.7352 956.5328 993.1568 993.5992 1016.1526 1073.2724 1108.8454 1128.2204 1129.2852 1178.2151 1184.6841 1216.2290 1230.1364 1262.6449 1294.2651 1297.3512 1332.3731 1348.7728 1360.7923 1396.4249 1403.1752 1419.4572 1441.4341 1454.1675 1468.7215 1478.3362 1489.9475 1512.5124 1538.6752 1574.3357 1605.7912 1607.4275 3007.1459 3101.2939 3116.3067 3127.4351 3162.8207 3166.3619 3170.8920 3189.2950 3209.6509 3536.9502
redmass: 7.1433 4.1006 7.0309 3.7384 1.1751 4.6894 7.8780 4.9980 7.5087 6.5408 3.7838 5.7267 4.8822 5.0736 9.6078 3.0496 5.3442 2.7621 6.4251 3.4369 7.2663 1.5601 7.3256 4.4676 7.3561 5.7428 3.4960 7.0260 7.7001 2.6028 6.0109 1.4556 1.9864 1.3757 7.0748 1.4382 1.3572 2.9809 4.4209 1.3014 4.0810 2.5351 1.6083 2.4398 1.3116 2.3706 1.1180 2.2198 3.7653 3.7311 1.5524 3.4729 4.2644 3.7975 2.7931 2.4451 4.0364 1.6418 2.6792 1.9245 1.0426 2.0820 1.4517 3.3134 6.9357 7.1548 4.2220 4.1606 1.0329 1.1027 1.0902 1.1019 1.0911 1.0923 1.0951 1.0958 1.0973 1.0756
irintensity: 0.0087 0.0035 0.1143 1.6883 0.0360 2.4847 2.3318 0.3114 2.0100 5.5215 5.0328 2.7156 4.4766 0.0099 16.6450 0.0007 11.3396 36.8271 3.7838 12.0269 29.6633 26.5476 1.5408 4.2730 0.5942 11.2134 0.3317 26.2322 1.4230 32.9438 23.5912 37.2832 20.7182 53.4201 17.4262 11.1435 0.4481 17.1282 28.3412 3.1357 29.4304 37.0252 26.7128 1.2123 1.0151 29.2974 2.2673 6.8394 3.0249 45.5766 22.0892 49.2385 61.0067 10.4980 16.8145 61.5568 17.4441 8.1554 46.7784 65.6926 17.0305 242.0331 183.1871 0.6417 410.1137 425.8451 194.1982 113.3940 51.7516 16.8627 14.6827 2.9458 2.1953 17.0780 2.6029 20.3291 2.1976 22.6832
temp: 298.150 k
press: 1.00000 atm
elementType: 17 7 7 7 7 7 6 6 6 6 6 6 6 6 6 6 6 6 1 1 1 1 1 1 1 1 1 1
symmnumber: 1
zpe: 541646.0 jmol-1
zpe.correction: 0.206302 hartree
zpe.thermalcorrener: 0.221209 hartree
zpe.thermalcorrenthalpy: 0.222153 hartree
zpe.thermalcorrgfe: 0.162808 hartree
zpe.sumelectzpe: -1195.834699 hartree
zpe.sumelectthermal: -1195.819791 hartree
zpe.sumelectthermalent: -1195.818847 hartree
zpe.sumelectthermalfe: -1195.878192 hartree
dipole: 1.9876 -2.0109 0.0014
dipole: 2.8274
quadrupole: -117.8565 -104.0144 -115.2117
quadrupole: 5.4983 0.0050 0.0392
quadrupole: -5.4956 8.3465 -2.8508 5.4983 0.0050 0.0392
hfenergy: -1196.0410007 hartree
pointgroup: C01 [X(C12H10Cl1N5)]
dipole: 0.7739644 -0.7966702 0.0608442 debye
polarizability: 341.8964809|-3.4303405|171.9208495|0.2913872|-7.6323323|70.9692995 unknown
InChI: InChI=1S/C12H10ClN5/c1-18-12-10(6-16-18)11(14-7-15-12)17-9-4-2-8(13)3-5-9/h2-7,17H,1H3
charge 0 multiplicity 1
28 atoms
Cl -6.485259 0.316511 -0.029164
N  4.164941 -0.360383 0.022887
N  -0.517761 -0.738759 0.048837
N  3.880794 -1.726061 0.127194
N  2.919635 1.758519 -0.14067
N  0.485401 1.430308 -0.117219
C  1.91251 -0.522168 0.033788
C  3.009486 0.396137 -0.035805
C  0.603847 0.071471 -0.012462
C  2.51989 -1.817706 0.133364
C  -1.902165 -0.42033 0.025125
C  5.545807 0.11762 -0.013133
C  -2.811953 -1.51191 0.104341
C  -2.409659 0.904041 -0.071172
C  1.631578 2.186777 -0.174673
C  -4.202949 -1.294933 0.08822
C  -3.803657 1.120431 -0.086999
C  -4.684026 0.025638 -0.007874
H  2.070532 -2.807072 0.209021
H  -0.313968 -1.73766 0.123957
H  6.075062 -0.175047 0.908666
H  6.074051 -0.306197 -0.883139
H  5.515773 1.215324 -0.093546
H  -2.435763 -2.540395 0.179193
H  -1.706147 1.735533 -0.13174
H  1.478395 3.266632 -0.258029
H  -4.89723 -2.137732 0.14927
H  -4.195062 2.139413 -0.16064
