program: Gaussian 09
title: 000219768
version: EM64L-G09RevD.01
frameworkgroup: C1[X(C11H11N5O)]
method: RPBEPBE
basis: SDD
operation: Freq
keyword: #p
keyword: freq=noraman
keyword: PBEPBE/SDD
title: #p freq=noraman PBEPBE/SDD
converged: YES YES NO NO
title: Mulliken charges:
elementType: O N N N N N C C C C C C C C C C C H H H H H H H H H H H
charge: -0.246459 -0.166564 -0.366925 -0.014502 -0.053612 -0.113810 0.018658 0.151046 0.253994 -0.508079 -0.414676 0.378793 -0.611086 -0.404267 -0.358541 -0.254723 -0.168809 0.283127 0.241167 0.318834 0.259412 0.245445 0.245450 0.262609 0.267835 0.242989 0.254076 0.258621
chargesum: 0.00000
title: Mulliken charges with hydrogens summed into heavy atoms:
elementType: O N N N N N C C C C C C C C C C C
charge: -0.246459 -0.166564 -0.048091 -0.014502 -0.053612 -0.113810 0.018658 0.151046 0.253994 0.016214 -0.155264 0.378793 0.142418 -0.136432 -0.115553 -0.000647 0.089812
polarizability: 2.14813081e+02 -2.17339604e+00 1.54954918e+02 -6.83063579e+00 7.58911153e+00 9.84288332e+01
1716.lowfreq: -5.2207 -0.0008 -0.0006 0.0006 2.2753 8.5361 19.1994 29.7940 34.8578
frequency: 17.6457 29.7612 34.8069 84.1745 101.2210 151.3586 165.5044 175.1049 235.6850 256.7770 274.8228 298.9082 324.9316 426.4860 497.7623 520.2611 526.0191 548.6552 593.8703 612.5426 630.4792 636.4303 665.9899 694.6011 726.8071 733.1049 746.4148 786.1921 825.2790 825.8178 860.2181 870.8575 877.1884 881.2046 933.0672 938.5654 953.5822 974.3310 1015.4356 1044.3641 1085.1096 1123.1946 1128.8260 1132.7236 1175.1518 1184.0337 1216.5137 1220.1859 1247.5432 1267.4698 1308.9974 1330.4548 1339.3776 1358.2556 1362.9843 1386.3662 1416.6157 1433.0108 1443.9931 1455.0812 1468.6664 1487.2248 1488.6728 1497.1058 1542.1173 1593.1287 1598.0301 3004.2962 3004.6959 3097.1092 3098.4343 3125.1698 3160.8830 3212.3818 3220.9375 3236.2041 3267.9955 3572.7700
redmass: 4.9601 4.9351 5.2004 3.2180 1.1656 4.3745 4.6356 4.9916 5.5841 4.1899 4.7351 5.1652 2.1164 3.9917 3.1311 5.1385 1.7065 3.3739 3.1577 5.3198 5.2274 4.4238 11.1712 5.8268 1.3151 5.9918 4.1209 3.0737 1.3751 1.7863 5.0320 6.6589 4.0952 1.4285 1.4356 3.4900 2.4872 3.1388 1.5653 2.9352 5.0378 2.5427 1.3107 1.5383 1.9027 2.8280 2.5730 1.7335 5.9214 1.3904 5.1390 2.4909 1.5988 3.4305 2.3637 1.8465 1.6784 1.9233 1.2910 1.5323 1.0433 1.8239 2.9774 2.4785 6.4859 5.5156 6.8748 1.0604 1.0382 1.1026 1.0963 1.1016 1.0921 1.0974 1.0918 1.0994 1.1085 1.0775
irintensity: 0.5523 0.6457 1.1531 1.7112 0.2521 1.1731 3.6056 0.0238 1.9051 8.6005 6.2684 1.3870 4.6730 11.8528 27.4387 5.5112 85.3540 8.0516 6.8951 5.7801 2.1140 32.7008 1.8261 5.4428 68.9799 32.2132 28.8220 35.2662 30.1639 11.4103 8.9522 8.1678 18.8528 1.1144 10.2285 8.1475 4.9329 3.1755 29.9597 0.8680 63.3968 10.0368 0.9947 20.9246 8.4295 53.8543 2.7508 10.7790 41.3777 31.0346 42.2636 33.5020 110.0085 17.7328 1.7478 33.4416 5.7228 23.2328 44.9610 49.9552 16.3407 10.4676 11.9191 16.1810 163.6238 423.1346 193.5281 68.7257 22.2177 18.6298 9.3121 3.1328 20.6619 2.3201 4.2273 0.0089 0.5462 49.4977
temp: 298.150 k
press: 1.00000 atm
elementType: 8 7 7 7 7 7 6 6 6 6 6 6 6 6 6 6 6 1 1 1 1 1 1 1 1 1 1 1
symmnumber: 1
zpe: 560976.5 jmol-1
zpe.correction: 0.213665 hartree
zpe.thermalcorrener: 0.228018 hartree
zpe.thermalcorrenthalpy: 0.228962 hartree
zpe.thermalcorrgfe: 0.169516 hartree
zpe.sumelectzpe: -773.507451 hartree
zpe.sumelectthermal: -773.493097 hartree
zpe.sumelectthermalent: -773.492153 hartree
zpe.sumelectthermalfe: -773.551599 hartree
dipole: 1.9500 -0.9216 0.1646
dipole: 2.1631
quadrupole: -87.6907 -99.9950 -96.2645
quadrupole: -3.2289 1.7482 1.8151
quadrupole: 6.9594 -5.3450 -1.6144 -3.2289 1.7482 1.8151
hfenergy: -773.7211152 hartree
pointgroup: C01 [X(C11H11N5O1)]
dipole: -0.7856896 -0.3244534 0.0406256 debye
polarizability: 214.3607537|-3.6149361|147.8955212|-10.0051018|-19.8559068|105.9405576 unknown
InChI: InChI=1S/C11H11N5O/c1-16-11-9(6-15-16)10(13-7-14-11)12-5-8-3-2-4-17-8/h2-4,6-7,12H,5H2,1H3
charge 0 multiplicity 1
28 atoms
O  -3.870014 -0.760133 0.714426
N  3.572642 -0.923296 -0.235299
N  -0.853909 0.000537 1.107912
N  3.103756 -2.099596 0.364616
N  2.729214 1.337525 -0.734532
N  0.412203 1.666743 0.01115
C  1.45182 -0.487775 0.402932
C  2.60962 0.068375 -0.232127
C  0.321071 0.391225 0.508944
C  -2.056064 0.858921 1.174409
C  1.823391 -1.828827 0.74742
C  -3.163485 0.391414 0.279197
C  4.929098 -0.846659 -0.77205
C  -3.678946 0.806999 -0.93674
C  1.59006 2.061985 -0.569263
C  -4.750086 -0.104967 -1.289133
C  -4.834518 -1.038847 -0.272123
H  -1.736462 1.867594 0.86938
H  -2.40905 0.899477 2.222165
H  -0.940535 -0.965942 1.423421
H  1.252984 -2.612443 1.244222
H  5.667583 -1.02861 0.026452
H  5.068663 -1.595711 -1.569343
H  5.067488 0.165197 -1.183867
H  -3.329212 1.660898 -1.513459
H  1.608876 3.088837 -0.947065
H  -5.372708 -0.067796 -2.180758
H  -5.467979 -1.900823 -0.083086
