program: Gaussian 09
title: 000219767
version: EM64L-G09RevD.01
frameworkgroup: C1[X(C17H12BrN5)]
method: RPBEPBE
basis: SDD
operation: Freq
keyword: #p
keyword: freq=noraman
keyword: PBEPBE/SDD
title: #p freq=noraman PBEPBE/SDD
converged: NO YES NO NO
title: Mulliken charges:
elementType: Br N N N N N C C C C C C C C C C C C C C C C C H H H H H H H H H H H H
charge: 0.004022 -0.263550 -0.448374 -0.000548 -0.054737 -0.113076 -0.017678 0.137515 0.227147 0.415677 -0.420396 0.471000 -0.350837 -0.398901 -0.355403 -0.247781 -0.465187 -0.226599 -0.203182 -0.244755 -0.195912 -0.186104 -0.239949 0.258543 0.319656 0.314349 0.285394 0.253135 0.342980 0.224617 0.228542 0.229297 0.230202 0.235699 0.255192
chargesum: 0.00000
title: Mulliken charges with hydrogens summed into heavy atoms:
elementType: Br N N N N N C C C C C C C C C C C C C C C C C
charge: 0.004022 -0.263550 -0.128718 -0.000548 -0.054737 -0.113076 -0.017678 0.137515 0.227147 0.415677 -0.161853 0.471000 -0.036488 -0.113507 -0.102268 0.095199 -0.240570 0.001942 0.026116 -0.014553 -0.195912 0.049596 0.015242
polarizability: 4.59350173e+02 1.60461103e+01 2.56760058e+02 -3.02220634e-01 4.61126332e-01 8.46533326e+01
1716.lowfreq: -1.9333 -0.0009 -0.0005 -0.0004 2.2982 3.3979 21.2464 28.1083 45.5339
frequency: 21.1839 28.0958 45.5193 46.0579 74.4662 102.8073 143.1161 157.3671 161.1757 203.9041 227.6902 233.9537 288.6818 293.0263 301.3837 320.7053 334.3806 378.5829 409.9675 438.6382 504.5272 505.3056 551.6102 559.0397 559.3155 606.0384 615.3494 620.0687 632.8647 648.7631 661.7722 678.1537 685.3442 702.0750 703.4155 763.9430 772.4912 781.0430 786.0771 826.3707 846.1467 860.9904 879.6484 883.0231 934.5123 939.5335 942.7499 955.4394 967.6325 977.7064 987.7962 993.3250 1006.5215 1019.9931 1037.9032 1050.5150 1065.5657 1094.4229 1095.6945 1137.9994 1172.6539 1181.8462 1190.1427 1221.8238 1235.2447 1258.0895 1282.0564 1297.2237 1325.8793 1335.8602 1360.3540 1369.7296 1385.6023 1397.7944 1403.3695 1429.2074 1434.7985 1452.2889 1468.2022 1488.7178 1509.5724 1526.8781 1566.5967 1597.4836 1603.0132 1608.3702 1613.5776 3118.2135 3131.7816 3144.0946 3154.1113 3162.1520 3166.1824 3176.2140 3181.9750 3187.1558 3189.0425 3207.6455 3539.8543
redmass: 6.8427 5.3849 5.1919 8.4865 5.7061 9.2598 4.9748 6.4404 5.0256 6.8253 4.9570 7.1716 5.8508 8.3879 6.0434 4.9264 5.6827 7.0464 2.9661 3.1173 4.3245 4.5900 2.6772 4.9133 6.8170 7.5833 6.7971 1.5838 6.2025 8.0531 7.6159 5.8358 2.1268 2.1031 6.9134 8.5328 1.6455 1.5524 2.9854 1.8229 7.2046 1.2454 7.2414 1.4071 1.4422 1.3718 1.4024 6.5216 1.3367 6.0717 6.2051 1.3491 1.3033 3.3005 3.8543 3.1632 1.9460 1.6448 1.6270 3.5079 1.0543 1.0799 1.1435 2.4458 2.1308 3.5757 1.4313 6.1639 1.5576 3.1089 2.3437 4.1625 8.0498 5.5136 3.6518 2.9315 2.5988 2.5253 2.4126 2.6253 3.7653 6.3236 7.7051 6.8240 3.7757 4.7935 5.1620 1.0893 1.0855 1.0908 1.0921 1.0964 1.0924 1.0971 1.0969 1.0940 1.0954 1.0970 1.0756
irintensity: 0.0391 0.3950 0.0150 0.0191 0.6497 0.9709 0.4126 0.9755 1.5704 1.3965 0.9767 0.5404 0.0282 2.5101 5.3518 3.0196 0.7213 5.2331 0.0020 9.9171 1.3938 1.3680 19.8198 3.2740 4.9713 1.4067 0.7561 21.8278 1.5970 8.1723 65.9125 16.4393 38.7051 36.7816 28.6468 5.7392 58.6889 53.2798 64.4671 13.8811 43.3543 0.0034 2.9459 1.0025 18.5358 17.5884 11.1242 118.3960 0.1074 12.0261 1.1628 0.1890 2.4191 2.5883 12.1002 28.1141 10.5530 2.6110 18.8980 8.7632 0.2496 0.6950 13.8216 3.8853 22.3401 2.4589 19.2334 129.9012 12.6465 86.9183 68.2709 6.0975 22.8325 173.9055 5.2866 35.7619 28.0299 24.1311 242.4105 354.2328 39.7347 401.6511 543.6308 30.5763 515.9793 53.6416 4.2588 13.2705 0.0033 23.6141 13.0323 23.1568 10.8639 31.4281 3.7006 36.6536 4.8740 1.9072 24.1377
temp: 298.150 k
press: 1.00000 atm
elementType: 35 7 7 7 7 7 6 6 6 6 6 6 6 6 6 6 6 6 6 6 6 6 6 1 1 1 1 1 1 1 1 1 1 1 1
symmnumber: 1
zpe: 676644.9 jmol-1
zpe.correction: 0.257720 hartree
zpe.thermalcorrener: 0.275779 hartree
zpe.thermalcorrenthalpy: 0.276724 hartree
zpe.thermalcorrgfe: 0.208682 hartree
zpe.sumelectzpe: -940.657964 hartree
zpe.sumelectthermal: -940.639905 hartree
zpe.sumelectthermalent: -940.638961 hartree
zpe.sumelectthermalfe: -940.707003 hartree
dipole: -0.3774 3.6578 -0.0106
dipole: 3.6772
quadrupole: -136.5707 -124.7638 -149.8713
quadrupole: 13.8806 -0.1003 0.1115
quadrupole: 0.4979 12.3048 -12.8027 13.8806 -0.1003 0.1115
hfenergy: -940.9156847 hartree
pointgroup: C01 [X(C17H12Br1N5)]
dipole: -0.0289862 -1.4385186 -0.1512694 debye
polarizability: 460.0161465|-8.1463868|254.1696572|-9.4624186|17.1096234|86.5777596 unknown
InChI: InChI=1S/C17H12BrN5/c18-12-5-4-6-13(9-12)22-16-15-10-21-23(17(15)20-11-19-16)14-7-2-1-3-8-14/h1-11,22H
charge 0 multiplicity 1
35 atoms
Br -6.16854 2.669333 0.488545
N  2.526602 -0.526702 -0.0539
N  -2.160441 -0.930169 0.005374
N  2.213254 -1.893833 -0.18398
N  1.247244 1.595306 0.187182
N  -1.182863 1.246901 0.208006
C  0.264751 -0.67962 -0.019972
C  1.364637 0.236489 0.047646
C  -1.048566 -0.106644 0.065949
C  3.908079 -0.128683 -0.044315
C  0.861166 -1.975018 -0.159613
C  -3.548865 -0.634033 0.069117
C  4.260334 1.239968 0.063492
C  4.907104 -1.12821 -0.146493
C  -0.043766 2.009012 0.259919
C  -4.063052 0.682329 0.222601
C  -4.443197 -1.736422 -0.027915
C  5.625633 1.59716 0.066716
C  6.264898 -0.75001 -0.14091
C  6.633411 0.611653 -0.035072
C  -5.45834 0.848621 0.275114
C  -5.833655 -1.527317 0.028609
C  -6.366033 -0.225541 0.182007
H  0.401013 -2.958582 -0.246784
H  -1.947866 -1.924016 -0.103365
H  3.476754 1.996816 0.143945
H  4.609009 -2.175511 -0.228715
H  -0.202095 3.085362 0.373187
H  -3.36786 1.519525 0.294309
H  -4.050519 -2.754157 -0.147212
H  5.898778 2.654806 0.149577
H  7.036758 -1.523348 -0.219721
H  7.690237 0.899163 -0.031765
H  -6.514543 -2.381299 -0.046891
H  -7.445158 -0.05913 0.226329
