program: Gaussian 09
title: 000219762
version: EM64L-G09RevD.01
frameworkgroup: C1[X(C17H12ClN5)]
method: RPBEPBE
basis: SDD
operation: Freq
keyword: #p
keyword: freq=noraman
keyword: PBEPBE/SDD
title: #p freq=noraman PBEPBE/SDD
converged: YES YES NO NO
title: Mulliken charges:
elementType: Cl N N N N N C C C C C C C C C C C C C C C C C H H H H H H H H H H H H
charge: -0.061616 -0.263188 -0.449140 -0.000634 -0.055102 -0.113008 -0.017635 0.137609 0.225746 0.415679 -0.420232 0.487626 -0.350629 -0.398931 -0.357639 -0.268984 -0.477142 -0.226620 -0.203199 -0.244769 -0.092197 -0.177479 -0.273718 0.258578 0.320063 0.314508 0.285380 0.253298 0.347412 0.224446 0.228477 0.229269 0.230163 0.233958 0.259650
chargesum: 0.00000
title: Mulliken charges with hydrogens summed into heavy atoms:
elementType: Cl N N N N N C C C C C C C C C C C C C C C C C
charge: -0.061616 -0.263188 -0.129077 -0.000634 -0.055102 -0.113008 -0.017635 0.137609 0.225746 0.415679 -0.161654 0.487626 -0.036121 -0.113551 -0.104342 0.078428 -0.252696 0.001858 0.026070 -0.014607 -0.092197 0.056479 -0.014068
polarizability: 4.52009962e+02 1.02079944e+01 2.42948043e+02 1.69916157e-01 -2.54320351e-01 8.38293044e+01
1716.lowfreq: -3.0186 -1.7607 -0.0025 -0.0024 -0.0013 7.6979 22.5673 31.7653 46.8279
frequency: 22.5190 31.7261 46.7943 54.2701 75.3823 119.6057 143.7467 162.1093 178.1701 203.7881 228.1813 244.4646 289.1629 306.4064 321.0350 340.0458 374.2371 391.9922 410.3643 441.9239 504.9722 505.7497 552.3657 559.0195 561.1214 606.3399 615.7423 619.9472 632.9791 650.2150 676.4069 677.9758 684.8087 702.3587 703.7919 764.2700 772.8663 780.1971 786.2263 826.5478 858.0604 861.0039 878.7278 881.4458 933.8507 936.0944 943.1967 956.3305 963.7630 980.0005 987.7925 993.4476 1006.8421 1020.4104 1039.5205 1052.1189 1072.0249 1090.7297 1096.5618 1137.5118 1172.9000 1179.2169 1190.5165 1222.7254 1236.6906 1258.0135 1280.5746 1297.6313 1325.6922 1335.2373 1360.4257 1370.7042 1385.9707 1397.4954 1405.7899 1432.0268 1435.7166 1452.4053 1469.4911 1489.4960 1510.2450 1526.9534 1569.4070 1597.2404 1604.3600 1611.5876 1613.9879 3116.5265 3131.4012 3143.3702 3154.3987 3161.8526 3166.4851 3176.0308 3181.6657 3188.9148 3191.4768 3206.9752 3539.8411
redmass: 7.5869 5.4010 4.6376 8.2093 5.7171 8.6349 4.9601 6.7665 5.4741 6.7323 4.9705 7.2812 5.8357 6.0388 4.9333 5.1861 8.0831 9.8959 2.9667 3.1266 3.8782 5.2070 2.6656 7.7958 4.4901 7.5977 6.7931 1.5921 6.2189 8.2471 7.5162 6.0364 2.1066 2.1100 6.9130 8.5051 1.6435 1.5509 3.0208 1.8193 7.1163 1.2457 1.4092 7.0362 1.4130 1.3899 1.4017 6.4597 1.3336 6.1049 6.2106 1.3485 1.3026 3.2145 3.8114 3.0893 1.9573 1.6057 1.6377 3.5796 1.0544 1.0825 1.1426 2.4381 2.1946 3.5665 1.4341 6.1286 1.5827 3.0311 2.2457 4.2103 8.0917 5.6325 3.6820 2.8293 2.7462 2.5319 2.4221 2.6276 3.7400 6.5187 7.3660 6.8671 3.3433 6.2770 5.3288 1.0897 1.0855 1.0908 1.0919 1.0965 1.0924 1.0971 1.0973 1.0954 1.0938 1.0971 1.0756
irintensity: 0.0234 0.4818 0.0082 0.1012 0.6596 1.3154 0.3414 0.4614 1.2289 1.3239 1.0347 0.3132 0.0187 3.9471 3.0512 1.1075 5.0538 7.5314 0.0015 9.1426 1.4999 1.4058 22.8953 5.3958 0.5333 1.1343 0.8904 22.0638 1.5840 17.0846 50.9775 17.9208 34.8757 36.7934 29.9857 5.7857 58.4493 60.9935 59.8854 14.1183 44.6593 0.0038 0.8129 1.6156 33.7190 6.7245 10.0880 117.9175 0.2686 7.1804 1.0876 0.1759 2.4717 2.5276 10.9007 25.9198 15.7480 3.2175 18.3410 9.0915 0.2255 0.8316 13.4933 4.0863 23.9371 2.7752 16.4881 126.2028 13.2689 88.4330 74.8296 1.9269 19.8339 172.8708 0.6304 25.1260 42.2360 27.6340 209.2592 348.0637 34.9188 383.1337 592.5590 18.0725 524.1693 18.3442 0.8722 12.8103 0.0194 23.6985 13.5358 23.1444 10.9843 31.2925 4.0184 5.2306 36.0562 1.8094 24.6227
temp: 298.150 k
press: 1.00000 atm
elementType: 17 7 7 7 7 7 6 6 6 6 6 6 6 6 6 6 6 6 6 6 6 6 6 1 1 1 1 1 1 1 1 1 1 1 1
symmnumber: 1
zpe: 677987.7 jmol-1
zpe.correction: 0.258232 hartree
zpe.thermalcorrener: 0.276037 hartree
zpe.thermalcorrenthalpy: 0.276981 hartree
zpe.thermalcorrgfe: 0.210353 hartree
zpe.sumelectzpe: -1387.258881 hartree
zpe.sumelectthermal: -1387.241076 hartree
zpe.sumelectthermalent: -1387.240132 hartree
zpe.sumelectthermalfe: -1387.306759 hartree
dipole: 0.0911 -3.7243 -0.0168
dipole: 3.7254
quadrupole: -132.0723 -126.8043 -146.9281
quadrupole: 17.4255 0.0930 -0.0868
quadrupole: 3.1960 8.4639 -11.6599 17.4255 0.0930 -0.0868
hfenergy: -1387.5171128 hartree
pointgroup: C01 [X(C17H12Cl1N5)]
dipole: -0.0433638 -1.4577323 -0.1462269 debye
polarizability: 452.3193916|-0.3210239|241.0424872|-8.2595322|14.903698|85.4254309 unknown
InChI: InChI=1S/C17H12ClN5/c18-12-5-4-6-13(9-12)22-16-15-10-21-23(17(15)20-11-19-16)14-7-2-1-3-8-14/h1-11,22H
charge 0 multiplicity 1
35 atoms
Cl -6.101639 2.567294 0.454364
N  2.52299 -0.53045 -0.050538
N  -2.165909 -0.921644 0.012023
N  2.20705 -1.896971 -0.173494
N  1.248699 1.595266 0.182009
N  -1.182133 1.252929 0.204753
C  0.260751 -0.678312 -0.015224
C  1.362457 0.235709 0.048028
C  -1.051332 -0.101678 0.068985
C  3.905176 -0.134385 -0.043611
C  0.854724 -1.975338 -0.151623
C  -3.55278 -0.618484 0.073092
C  4.259681 1.233947 0.060953
C  4.902569 -1.135704 -0.144626
C  -0.041188 2.01247 0.252893
C  -4.059488 0.700882 0.218186
C  -4.453681 -1.716819 -0.018188
C  5.625608 1.588995 0.062386
C  6.261072 -0.759656 -0.141106
C  6.63185 0.601685 -0.038189
C  -5.452966 0.871017 0.267519
C  -5.843552 -1.499812 0.035539
C  -6.369025 -0.194347 0.180337
H  0.392532 -2.95828 -0.235332
H  -1.957353 -1.916855 -0.091663
H  3.477333 1.99221 0.139568
H  4.602603 -2.182671 -0.224332
H  -0.197037 3.089542 0.362011
H  -3.364777 1.538547 0.286604
H  -4.066582 -2.737426 -0.130901
H  5.900362 2.646434 0.143043
H  7.03163 -1.534415 -0.219171
H  7.689177 0.887561 -0.036254
H  -6.528484 -2.350935 -0.035551
H  -7.446438 -0.015904 0.222907
