program: Gaussian 09
title: 000219761
version: EM64L-G09RevD.01
frameworkgroup: C1[X(C14H15N5)]
method: RPBEPBE
basis: SDD
operation: Freq
keyword: #pfreq=noraman
keyword: PBEPBE/SDD
title: #p freq=noraman PBEPBE/SDD
converged: YES YES NO NO
title: Mulliken charges:
elementType: N N N N N C C C C C C C C C C C C C C H H H H H H H H H H H H H H H
charge: -0.378932 -0.263978 -0.008307 -0.091245 -0.070181 -0.025543 0.003896 0.225068 0.141179 -0.717462 -0.672362 -0.423028 0.411275 -0.352556 -0.400889 -0.375259 -0.228434 -0.204048 -0.247385 0.251640 0.306948 0.229288 0.202033 0.234159 0.257005 0.212188 0.198664 0.258567 0.316430 0.284828 0.245751 0.226060 0.226866 0.227764
chargesum: 0.00000
title: Mulliken charges with hydrogens summed into heavy atoms:
elementType: N N N N N C C C C C C C C C C C C C C
charge: -0.071984 -0.263978 -0.008307 -0.091245 -0.070181 0.226097 0.003896 0.225068 0.141179 -0.051982 -0.004505 -0.164461 0.411275 -0.036126 -0.116061 -0.129507 -0.002374 0.022818 -0.019622
polarizability: 3.24498430e+02 -2.33380544e+00 1.85771281e+02 -1.67919333e+00 -4.21944513e+00 8.95858529e+01
1716.lowfreq: -10.9668 -3.5029 -0.8520 -0.0007 -0.0005 -0.0002 29.1049 35.9887 49.3478
frequency: 28.5202 35.8149 49.3421 79.2588 84.3917 141.7061 153.4526 202.2374 210.4680 221.8076 242.7256 263.0480 298.4011 316.4979 337.4918 376.9461 411.4749 416.5697 448.1916 482.5386 505.6309 516.4946 559.2625 595.0796 615.2106 634.9592 639.7904 675.1056 702.7490 703.3175 744.0469 771.9472 785.3130 827.7825 829.2639 861.2451 870.9022 917.7507 929.0221 936.2095 941.6064 947.0104 971.2050 987.3341 992.7768 1007.0581 1021.0399 1036.6325 1051.7144 1094.2557 1126.1628 1139.0015 1171.3134 1172.5380 1181.2798 1190.0427 1223.7455 1255.1546 1301.4285 1310.7492 1327.6497 1333.4276 1346.0227 1360.8398 1375.5878 1382.3235 1395.1929 1395.8892 1402.7638 1432.2583 1451.2941 1460.0991 1468.5333 1475.8525 1486.5631 1487.6020 1494.4151 1526.7038 1594.3043 1597.0284 1613.6719 2974.7148 2982.0227 3034.1225 3068.9341 3081.4070 3094.5125 3099.3751 3129.2444 3141.4341 3157.6410 3159.9893 3172.6121 3187.8286 3207.9037 3557.1590
redmass: 3.5703 3.4324 4.1423 4.2823 4.3340 4.6131 4.4031 6.9826 1.0285 3.7590 1.1389 5.9942 5.2385 4.9806 2.9777 3.4401 2.9790 3.3909 2.1025 1.4497 3.3489 5.1579 3.7802 7.7715 6.5946 6.0230 7.8114 10.7602 2.1847 6.1245 7.3756 1.6472 3.4457 2.6118 1.7229 1.2464 6.0588 1.3352 2.4183 1.4442 1.4036 1.4995 3.9031 6.2081 1.3431 1.3004 3.1016 3.0914 2.4618 1.6224 3.7456 2.1384 1.1302 1.7136 2.4956 1.1486 2.1272 3.6794 1.6354 4.5178 1.5639 2.9905 1.2803 2.3753 1.2120 5.1650 1.5415 3.0347 2.4394 2.0587 2.3500 1.0937 1.0626 1.3251 1.0563 1.9645 2.5986 7.2507 6.4766 6.9634 5.9444 1.0384 1.0362 1.0854 1.0978 1.0987 1.0994 1.0999 1.0853 1.0907 1.0919 1.0962 1.0975 1.0953 1.0971 1.0772
irintensity: 0.2501 0.7481 0.8608 0.5375 0.8402 0.1672 1.1111 2.9336 0.1164 1.0341 0.0455 1.2600 3.1102 3.0400 0.4445 1.8209 0.0055 3.9666 7.7125 87.6131 6.9867 3.0722 1.8748 0.9678 0.6880 4.2725 22.9875 9.2942 36.7275 17.2325 2.1803 60.8013 38.0382 6.8089 11.7003 0.0042 16.1978 2.9408 34.1224 11.5550 8.5326 9.4652 25.2292 1.6818 0.3034 2.6831 2.0323 23.8518 0.1274 17.2563 15.7691 34.7191 3.5065 11.7658 95.1897 2.0637 22.0286 10.2511 3.7077 96.1346 32.8956 135.2543 17.6921 67.5322 25.4392 10.0458 4.6290 126.3832 11.0114 3.6343 12.9220 14.4736 8.8105 40.3435 24.7564 157.7033 76.7194 115.2548 709.0283 86.0975 2.9672 26.6665 36.5375 0.3740 12.8297 60.2036 31.0776 30.9751 0.0083 25.9483 18.2231 19.5793 33.0862 4.6456 2.4260 53.7602
temp: 298.150 k
press: 1.00000 atm
elementType: 7 7 7 7 7 6 6 6 6 6 6 6 6 6 6 6 6 6 6 1 1 1 1 1 1 1 1 1 1 1 1 1 1 1
symmnumber: 1
zpe: 711783.7 jmol-1
zpe.correction: 0.271104 hartree
zpe.thermalcorrener: 0.287475 hartree
zpe.thermalcorrenthalpy: 0.288419 hartree
zpe.thermalcorrgfe: 0.226103 hartree
zpe.sumelectzpe: -814.897313 hartree
zpe.sumelectthermal: -814.880942 hartree
zpe.sumelectthermalent: -814.879998 hartree
zpe.sumelectthermalfe: -814.942314 hartree
dipole: 3.4842 -1.8334 0.1250
dipole: 3.9391
quadrupole: -88.4534 -107.1469 -116.6065
quadrupole: -8.3593 -0.1938 -0.3547
quadrupole: 15.6155 -3.0780 -12.5375 -8.3593 -0.1938 -0.3547
hfenergy: -815.1684168 hartree
pointgroup: C01[X(C14H15N5)]
dipole: 1.3675572 0.7252508 -0.0748351 debye
polarizability: 324.4740034|3.0174183|185.3721844|1.6385455|-7.6312648|90.0093761 unknown
InChI: InChI=1S/C14H15N5/c1-10(2)18-13-12-8-17-19(14(12)16-9-15-13)11-6-4-3-5-7-11/h3-10,18H,1-2H3
charge 0 multiplicity 1
34 atoms
N  3.457343 0.608554 0.061992
N  -1.267325 0.546003 -0.037131
N  -0.872275 1.893321 -0.168499
N  2.328066 -1.453131 0.252301
N  -0.121506 -1.65021 0.224665
C  4.796548 -0.028159 0.136461
C  0.998333 0.561649 0.010696
C  2.276816 -0.086409 0.104442
C  -0.15314 -0.286944 0.075737
C  5.805913 0.999765 0.683748
C  5.219873 -0.593304 -1.239745
C  0.482181 1.889526 -0.138776
C  -2.6680 0.230269 -0.035562
C  -3.100244 -1.11521 0.077353
C  -3.608445 1.284361 -0.150058
C  1.145616 -2.139259 0.307488
C  -4.483788 -1.393808 0.073528
C  -4.985951 0.984447 -0.15162
C  -5.433341 -0.353098 -0.040452
H  4.698786 -0.873726 0.840376
H  3.418515 1.61767 -0.08891
H  6.805142 0.539358 0.770482
H  5.900516 1.869709 0.004039
H  5.506845 1.364452 1.6827
H  4.474584 -1.324965 -1.594175
H  6.196397 -1.10517 -1.159647
H  5.31293 0.214663 -1.98926
H  1.005984 2.840637 -0.225936
H  -2.359873 -1.913688 0.166758
H  -3.249251 2.312106 -0.235925
H  1.234983 -3.223118 0.430639
H  -4.817298 -2.433865 0.160388
H  -5.711621 1.800573 -0.23999
H  -6.505116 -0.579302 -0.042608
