program: Gaussian 09
title: 000219760
version: EM64L-G09RevD.01
frameworkgroup: C1[X(C15H17N5)]
method: RPBEPBE
basis: SDD
operation: Freq
keyword: #pfreq=noraman
keyword: PBEPBE/SDD
title: #p freq=noraman PBEPBE/SDD
converged: YES YES NO NO
title: Mulliken charges:
elementType: N N N N N C C C C C C C C C C C C C C C H H H H H H H H H H H H H H H H H
charge: -0.372561 -0.263693 -0.008781 -0.080714 -0.070622 -0.423443 -0.333110 -0.000075 -0.341892 0.226250 0.141749 -0.423571 0.410740 -0.680049 -0.352367 -0.400967 -0.375446 -0.228351 -0.204113 -0.247392 0.196978 0.213010 0.237816 0.240034 0.207745 0.192410 0.312230 0.258340 0.208149 0.222439 0.211355 0.316604 0.284833 0.246044 0.226002 0.226780 0.227634
chargesum: 0.00000
title: Mulliken charges with hydrogens summed into heavy atoms:
elementType: N N N N N C C C C C C C C C C C C C C C
charge: -0.060331 -0.263693 -0.008781 -0.080714 -0.070622 -0.013454 0.144740 -0.000075 0.058264 0.226250 0.141749 -0.165230 0.410740 -0.038106 -0.035763 -0.116133 -0.129402 -0.002349 0.022668 -0.019758
polarizability: 3.35867989e+02 -8.85452433e+00 1.97370825e+02 1.28118011e+01 1.04612318e+01 9.90176116e+01
1716.lowfreq: -2.6549 0.0004 0.0007 0.0008 4.2117 7.8178 18.8313 33.0317 44.8035
frequency: 17.2956 33.0288 44.8015 50.5445 75.2258 94.6599 124.1000 154.0297 173.9579 204.4611 224.2108 241.2295 249.3407 282.6052 301.0701 309.2618 318.8337 405.2727 411.3194 443.3334 462.1250 505.4373 519.6463 558.4775 595.4943 615.4766 634.9935 642.4559 674.8480 702.8760 703.2290 731.4573 752.6643 771.8118 785.5713 820.6283 828.9092 838.5481 861.5332 878.3257 936.2922 940.3815 941.6242 947.5449 974.7162 987.2439 992.7424 1007.1078 1020.3994 1034.6953 1040.7560 1059.4060 1094.5806 1099.0372 1125.5281 1136.3457 1164.8714 1171.3212 1189.4637 1219.4777 1227.0836 1249.6195 1257.3975 1290.6459 1304.4248 1308.7315 1325.0415 1331.7930 1336.8964 1358.7420 1362.3281 1382.4556 1393.6842 1395.4180 1400.9415 1433.1105 1451.3788 1464.4136 1474.8077 1478.9943 1484.7618 1487.2751 1489.0115 1493.6745 1527.3475 1596.3034 1598.6652 1614.3552 2963.0239 2973.8298 2974.7999 2987.4041 3013.7214 3037.2080 3048.1315 3070.8547 3077.1665 3129.0383 3141.2174 3158.1010 3159.6651 3171.8485 3187.6050 3207.8130 3569.4409
redmass: 3.8902 4.0572 4.2470 3.9055 1.8142 3.9591 4.7447 4.2839 3.6548 6.8372 1.5139 2.4969 1.8227 5.8771 5.5433 3.3861 4.9532 5.2885 2.9778 1.1935 3.1893 3.3627 4.9176 3.8040 7.9064 6.5992 6.0542 7.5891 10.6589 2.1338 6.4530 1.3332 3.2714 1.6452 3.4189 1.8829 1.7210 1.7174 1.2460 5.0444 1.4518 2.5431 1.4069 1.4345 3.0385 6.2105 1.3427 1.3008 3.1714 3.9039 2.7035 2.2925 1.6324 2.3920 2.0831 3.8796 2.3590 1.0552 1.1423 1.4842 1.6347 1.6993 2.0623 1.1496 1.2871 5.4145 1.5856 2.1443 1.7611 1.7439 2.0407 4.9280 1.2134 5.1722 2.6546 2.0219 2.2944 1.1765 1.0567 1.0427 2.7605 1.1037 1.1097 2.6957 6.8517 6.8016 6.7078 5.9701 1.0638 1.0574 1.0403 1.0633 1.0951 1.1003 1.1008 1.1008 1.0993 1.0853 1.0907 1.0919 1.0961 1.0977 1.0953 1.0971 1.0773
irintensity: 0.4007 0.9577 0.7887 0.9453 0.0552 1.3600 0.1398 0.7980 0.2310 2.5893 0.4997 0.4351 0.6292 3.6028 2.5188 0.7396 2.6278 9.0280 0.0062 91.6743 6.5196 3.1612 1.4037 3.9840 0.6133 0.7859 3.8013 25.1129 9.0247 36.9495 15.8422 6.2650 3.9184 61.0232 37.2046 2.4763 11.4995 7.3223 0.0001 13.6213 14.5372 28.2456 8.5572 9.8276 30.4813 1.4651 0.3194 2.6895 1.9055 8.9045 10.8359 1.1525 16.4555 2.9585 5.5164 26.2130 9.6604 0.0468 5.6487 18.0300 11.9743 3.0078 8.5061 0.8132 0.7252 97.7556 11.6175 47.6965 167.5856 31.7831 18.3094 7.2667 14.4547 77.5845 33.3075 0.3725 11.8106 23.7220 9.2766 13.1481 154.1611 34.9201 51.8509 90.1368 113.3504 93.5992 719.6366 0.3957 13.1241 80.6677 20.5570 29.6807 6.2115 30.4382 32.4818 87.9033 42.7028 0.0066 25.9832 19.0183 18.3048 34.5670 4.6785 2.4505 60.2492
temp: 298.150 k
press: 1.00000 atm
elementType: 7 7 7 7 7 6 6 6 6 6 6 6 6 6 6 6 6 6 6 6 1 1 1 1 1 1 1 1 1 1 1 1 1 1 1 1 1
symmnumber: 1
zpe: 786645.1 jmol-1
zpe.correction: 0.299617 hartree
zpe.thermalcorrener: 0.317316 hartree
zpe.thermalcorrenthalpy: 0.318260 hartree
zpe.thermalcorrgfe: 0.251801 hartree
zpe.sumelectzpe: -854.115513 hartree
zpe.sumelectthermal: -854.097815 hartree
zpe.sumelectthermalent: -854.096870 hartree
zpe.sumelectthermalfe: -854.163329 hartree
dipole: -3.9421 -1.5279 -0.4419
dipole: 4.2509
quadrupole: -94.7344 -116.8782 -122.2675
quadrupole: 4.5390 2.8997 1.6408
quadrupole: 16.5590 -5.5848 -10.9741 4.5390 2.8997 1.6408
hfenergy: -854.4151305 hartree
pointgroup: C01 [X(C15H17N5)]
dipole: -1.5429532 -0.6275205 -0.1501481 debye
polarizability: 336.2482551|-6.4836153|197.5705388|11.323638|8.4706026|98.4376319 unknown
InChI: InChI=1S/C15H17N5/c1-2-3-9-16-14-13-10-19-20(15(13)18-11-17-14)12-7-5-4-6-8-12/h4-8,10-11,16H,2-3,9H2,1H3
charge 0 multiplicity 1
37 atoms
N  -3.043017 0.05697 -0.398477
N  1.642379 -0.501702 -0.105648
N  1.09087 -1.783921 -0.3025
N  -1.67934 1.944228 -0.062407
N  0.769625 1.82107 0.111515
C  -5.526647 -0.01635 -0.436128
C  -4.27131 0.876851 -0.416773
C  -0.602741 -0.22418 -0.243443
C  -5.743638 -0.839566 0.856681
C  -1.789927 0.584464 -0.237495
C  0.638246 0.467157 -0.064782
C  -0.249971 -1.605442 -0.383238
C  3.066759 -0.369904 0.018978
C  -7.029894 -1.691335 0.804755
C  3.655943 0.905154 0.211814
C  3.871471 -1.534351 -0.055148
C  -0.426392 2.470212 0.101071
C  5.059038 1.001329 0.329471
C  5.271008 -1.416196 0.065019
C  5.874262 -0.151035 0.257492
H  -5.489968 -0.697353 -1.313162
H  -6.405015 0.63879 -0.595466
H  -4.270051 1.535591 0.471151
H  -4.252032 1.543728 -1.30098
H  -5.788525 -0.145765 1.7197
H  -4.872429 -1.500237 1.041832
H  -3.13127 -0.946391 -0.560337
H  -0.880923 -2.480113 -0.536081
H  -6.997325 -2.41426 -0.03233
H  -7.171188 -2.263602 1.739342
H  -7.922246 -1.053392 0.661454
H  3.018376 1.790754 0.266941
H  3.392304 -2.504248 -0.204687
H  -0.385391 3.55521 0.238482
H  5.514003 1.986917 0.478466
H  5.891505 -2.317404 0.007528
H  6.96245 -0.065876 0.349692
