program: Gaussian 09
title: 000219759
version: EM64L-G09RevD.01
frameworkgroup: C1[X(C17H13N5)]
method: RPBEPBE
basis: SDD
operation: Freq
keyword: #pfreq=noraman
keyword: PBEPBE/SDD
title: #p freq=noraman PBEPBE/SDD
converged: YES YES NO NO
title: Mulliken charges:
elementType: N N N N N C C C C C C C C C C C C C C C C C H H H H H H H H H H H H H
charge: -0.263878 -0.441792 -0.003274 -0.059118 -0.106567 -0.019183 0.138519 0.218711 0.414812 -0.420763 0.457977 -0.351309 -0.399816 -0.362837 -0.227583 -0.203395 -0.456348 -0.330543 -0.245717 -0.197830 -0.218262 -0.253977 0.257827 0.315425 0.315260 0.285199 0.249596 0.227509 0.228464 0.217463 0.320441 0.229331 0.227834 0.227138 0.230686
chargesum: 0.00000
title: Mulliken charges with hydrogens summed into heavy atoms:
elementType: N N N N N C C C C C C C C C C C C C C C C C
charge: -0.263878 -0.126367 -0.003274 -0.059118 -0.106567 -0.019183 0.138519 0.218711 0.414812 -0.162936 0.457977 -0.036049 -0.114617 -0.113241 -0.000073 0.025068 -0.238885 -0.010103 -0.016387 0.030005 0.008877 -0.023291
polarizability: 4.43943073e+02 2.73463535e+00 2.19621347e+02 -3.67468144e-02 2.69080698e-02 8.13469194e+01
1716.lowfreq: -2.9417 -0.0006 -0.0003 0.0004 3.4491 11.0566 27.3829 39.3846 50.0820
frequency: 27.2897 39.3760 50.0225 67.6120 75.1642 142.2325 147.7148 187.9177 201.5082 228.0157 277.1010 289.2469 318.0614 320.0664 376.7901 409.5785 411.0662 502.6155 504.0024 506.3877 554.1616 558.8146 605.8723 614.2890 616.5816 622.3348 632.3384 651.6842 677.3996 697.3567 702.3802 703.4547 763.6965 767.8923 772.5812 785.3381 808.0269 825.6108 843.8351 861.0504 878.3172 920.9850 934.5122 942.5322 954.6233 974.6491 984.8560 987.7219 993.2099 1007.1368 1007.9134 1019.2683 1025.6695 1038.6324 1052.1455 1084.8837 1095.4306 1137.8345 1172.1106 1172.3547 1188.9926 1190.0282 1221.0437 1239.9118 1258.1970 1300.3327 1319.8182 1326.8922 1334.8960 1363.2379 1373.5770 1386.5079 1396.8746 1409.8659 1438.2644 1438.9803 1453.8928 1486.0396 1490.2122 1513.0957 1528.7358 1578.6554 1597.8030 1608.9934 1613.6702 1616.2888 3107.5424 3130.9101 3133.5807 3142.9016 3145.7555 3161.4168 3162.2105 3166.8301 3174.5794 3188.0938 3192.2791 3206.5439 3535.0353
redmass: 6.2435 3.7162 4.6890 5.6480 5.7840 4.9585 5.4365 6.3932 6.8649 4.9334 5.2413 5.7593 6.2082 4.9288 7.1382 2.9444 2.9723 6.7313 3.1086 2.8436 3.1738 7.7612 7.5978 6.4875 6.7449 1.4768 6.0749 8.2355 5.5401 2.0109 2.0961 6.9963 8.5643 1.7010 1.6494 3.0288 5.8951 1.8132 1.2824 1.2460 7.3005 1.4139 1.4459 1.4027 6.5610 1.3455 6.1825 6.2212 1.3459 1.3016 1.3024 3.4015 2.3610 3.3771 2.8118 1.6180 1.6297 3.5552 1.0579 1.0549 1.1138 1.1441 2.1957 2.7591 3.3948 6.5255 1.4553 1.6428 2.9340 2.2499 3.9195 8.2305 5.6946 3.0085 2.5960 2.5574 2.5430 2.3165 2.6256 3.6623 6.2194 5.5327 6.9400 3.9681 5.7320 4.7772 1.0887 1.0854 1.0867 1.0908 1.0933 1.0961 1.0923 1.0998 1.0973 1.0954 1.0955 1.0971 1.0755
irintensity: 0.2208 0.0466 0.0190 0.2031 0.7252 0.2732 2.2795 1.0455 2.1051 1.0685 3.8234 0.1040 0.2060 2.8732 4.1886 0.0000 0.0000 0.7551 19.5201 8.9582 17.0570 5.7628 1.7982 0.3636 2.4822 14.9702 4.4091 33.5370 12.8217 49.9289 35.8372 25.3802 5.8851 80.5131 59.2572 58.7903 3.0910 11.9312 0.6900 0.0002 12.7399 13.0540 10.4603 9.3445 82.1250 0.0877 2.3202 1.5037 0.2354 2.2606 3.3325 9.4450 8.8963 9.7563 13.0097 15.5496 19.7338 7.1087 0.0202 0.4704 0.7664 13.5090 7.5858 36.5125 13.3170 135.5496 1.4601 20.1019 94.8709 71.9660 2.0154 20.9704 165.1011 0.0213 34.2911 23.8067 39.0480 258.0516 237.8773 15.9666 362.4465 655.3370 9.8964 308.0790 3.5074 15.8596 15.8680 0.0160 0.1991 24.4922 28.1060 23.7213 12.7881 29.9740 33.9127 5.2634 19.8505 1.9547 28.0895
temp: 298.150 k
press: 1.00000 atm
elementType: 7 7 7 7 7 6 6 6 6 6 6 6 6 6 6 6 6 6 6 6 6 6 1 1 1 1 1 1 1 1 1 1 1 1 1
symmnumber: 1
zpe: 703725.6 jmol-1
zpe.correction: 0.268035 hartree
zpe.thermalcorrener: 0.284521 hartree
zpe.thermalcorrenthalpy: 0.285466 hartree
zpe.thermalcorrgfe: 0.222421 hartree
zpe.sumelectzpe: -927.868926 hartree
zpe.sumelectthermal: -927.852439 hartree
zpe.sumelectthermalent: -927.851495 hartree
zpe.sumelectthermalfe: -927.914540 hartree
dipole: -1.6813 -1.7973 0.0040
dipole: 2.4611
quadrupole: -108.5518 -115.2406 -135.4724
quadrupole: 6.8267 0.0001 0.0235
quadrupole: 11.2031 4.5143 -15.7174 6.8267 0.0001 0.0235
hfenergy: -928.1369606 hartree
pointgroup: C01 [X(C17H13N5)]
dipole: 0.6607029 0.7078124 0.0047419 debye
polarizability: 443.9331989|2.9779218|219.6272956|1.1528356|0.2023016|81.3508447 unknown
InChI: InChI=1S/C17H13N5/c1-3-7-13(8-4-1)21-16-15-11-20-22(17(15)19-12-18-16)14-9-5-2-6-10-14/h1-12,21H
charge 0 multiplicity 1
35 atoms
N  -2.231704 0.531518 -0.003252
N  2.470622 0.68037 0.010286
N  -1.847328 1.886751 -0.000024
N  -1.066399 -1.668639 -0.005559
N  1.380285 -1.45281 0.002887
C  0.035411 0.560792 0.003056
C  -1.110788 -0.29813 -0.002574
C  1.319451 -0.084665 0.005316
C  -3.631218 0.20515 -0.007053
C  -0.492315 1.893007 0.005874
C  3.846412 0.309793 0.015089
C  -4.052013 -1.148364 -0.009626
C  -4.579596 1.257971 -0.008469
C  0.202518 -2.153257 -0.002686
C  -5.433502 -1.436508 -0.013722
C  -5.954859 0.948352 -0.012366
C  4.789178 1.37567 0.018952
C  4.306568 -1.034106 0.016402
C  -6.391224 -0.397287 -0.01511
C  6.171329 1.104494 0.02435
C  5.695163 -1.287224 0.02202
C  6.635353 -0.231793 0.026156
H  0.019979 2.854439 0.010447
H  2.309224 1.689942 0.010797
H  -3.306509 -1.946821 -0.008055
H  -4.229283 2.292317 -0.006422
H  0.302949 -3.242703 -0.003345
H  -5.758808 -2.482661 -0.015944
H  -6.687209 1.763093 -0.013294
H  4.439653 2.416965 0.017424
H  3.575455 -1.843356 0.012454
H  -7.46126 -0.631026 -0.018302
H  6.884242 1.936175 0.027122
H  6.042591 -2.326473 0.02337
H  7.709532 -0.443973 0.030706
