program: Gaussian 09
title: 000219758
version: EM64L-G09RevD.01
frameworkgroup: C1[X(C13H13N5)]
method: RPBEPBE
basis: SDD
operation: Freq
keyword: #pfreq=noraman
keyword: PBEPBE/SDD
title: #p freq=noraman PBEPBE/SDD
converged: NO YES NO NO
title: Mulliken charges:
elementType: N N N N N C C C C C C C C C C C C C H H H H H H H H H H H H H
charge: -0.263591 -0.369458 -0.008914 -0.070303 -0.078712 0.008797 0.143068 0.213635 0.411187 -0.420959 -0.300832 -0.352484 -0.400821 -0.374118 -0.720848 -0.228287 -0.203915 -0.247415 0.258829 0.317230 0.240011 0.240785 0.316469 0.284821 0.246029 0.221795 0.220774 0.236314 0.226146 0.226904 0.227862
chargesum: 0.00000
title: Mulliken charges with hydrogens summed into heavy atoms:
elementType: N N N N N C C C C C C C C C C C C C
charge: -0.263591 -0.052228 -0.008914 -0.070303 -0.078712 0.008797 0.143068 0.213635 0.411187 -0.162129 0.179964 -0.036015 -0.116000 -0.128089 -0.041965 -0.002140 0.022988 -0.019553
polarizability: 3.06569932e+02 -5.43549248e-01 1.78134539e+02 -9.76751207e-02 5.39154898e-02 7.67445839e+01
1716.lowfreq: -4.3246 -0.0007 0.0003 0.0008 1.7383 5.0727 24.2650 41.7208 47.1491
frequency: 24.1785 41.7168 47.1367 85.2194 105.8979 150.0857 151.3416 203.5138 244.1731 263.1616 286.5548 299.9618 318.3110 336.3233 404.9900 411.0966 447.5340 505.0703 513.3256 558.4929 595.4045 614.9787 634.8691 640.2908 674.4811 702.5767 703.0429 746.0570 771.6056 785.0091 793.4559 828.2056 860.9332 864.1847 897.7327 937.7376 941.4881 959.8928 987.5208 992.4846 1007.0388 1019.4037 1034.0558 1044.6901 1061.5587 1094.7890 1136.7983 1143.1814 1167.0084 1171.6727 1190.4746 1223.2688 1255.3980 1258.9315 1308.7245 1325.6383 1332.8850 1338.0068 1361.0471 1382.7250 1395.7195 1398.8391 1402.1278 1433.5496 1451.8943 1477.9101 1479.2126 1484.4928 1492.0945 1496.7159 1527.8730 1596.7519 1599.3609 1614.2659 2984.4247 2998.2729 3039.7908 3079.8958 3096.3703 3129.7460 3141.6570 3158.2338 3160.4232 3172.3602 3187.8337 3209.0769 3572.4893
redmass: 2.5343 3.6303 3.8719 4.1490 3.0611 3.4282 4.7379 5.6071 1.4871 5.1553 3.9559 4.7713 4.9277 3.6310 5.7937 2.9780 1.1503 3.3566 6.2315 3.8075 7.9093 6.5983 6.0305 7.9639 10.5370 2.0949 6.9279 7.3171 1.6496 3.1785 1.1247 1.7378 1.2468 4.0957 3.1184 1.4452 1.4044 5.0271 6.2180 1.3427 1.3003 3.3776 3.6279 2.4507 2.6393 1.6269 4.1540 1.5256 2.7466 1.0541 1.1413 2.0966 3.8449 1.1007 5.6652 1.6154 2.0277 1.7726 2.4084 4.9510 4.9338 1.4028 2.1715 2.0420 2.3522 1.1651 1.0401 2.4501 2.2728 1.2339 6.7753 6.8486 6.6766 5.9601 1.0373 1.0593 1.1035 1.1015 1.0980 1.0853 1.0907 1.0920 1.0960 1.0976 1.0953 1.0971 1.0777
irintensity: 0.0162 1.2930 2.1642 1.3794 0.0705 0.0353 0.8246 3.1787 0.0299 0.3599 3.9250 2.4231 2.2920 1.5312 6.9212 0.0083 91.4403 3.1024 1.2942 3.7120 0.6341 0.7384 3.6554 24.8812 9.6760 37.7559 15.3425 1.3804 60.4126 41.5986 0.7158 12.5211 0.0004 12.8071 21.9967 13.0896 7.6018 45.0248 1.6923 0.3003 2.6946 3.3919 18.1138 3.5933 0.1243 17.6356 29.2556 2.2678 20.8206 0.0039 5.1150 25.9582 9.1377 0.0479 94.8980 9.3427 38.8315 167.8476 41.5704 7.1010 68.4185 67.3512 12.0904 0.5270 14.6114 58.9990 14.0366 92.5638 151.1755 17.0655 106.1408 49.5237 700.1867 0.0912 31.2023 26.7483 5.3001 53.0113 30.7900 0.0013 25.9533 18.2139 17.9183 33.8518 4.7251 2.4792 60.2057
temp: 298.150 k
press: 1.00000 atm
elementType: 7 7 7 7 7 6 6 6 6 6 6 6 6 6 6 6 6 6 1 1 1 1 1 1 1 1 1 1 1 1 1
symmnumber: 1
zpe: 639815.0 jmol-1
zpe.correction: 0.243693 hartree
zpe.thermalcorrener: 0.258726 hartree
zpe.thermalcorrenthalpy: 0.259671 hartree
zpe.thermalcorrgfe: 0.199977 hartree
zpe.sumelectzpe: -775.670065 hartree
zpe.sumelectthermal: -775.655031 hartree
zpe.sumelectthermalent: -775.654087 hartree
zpe.sumelectthermalfe: -775.713780 hartree
dipole: 3.5657 -1.9356 -0.0001
dipole: 4.0572
quadrupole: -78.5572 -101.3754 -110.0602
quadrupole: -9.2792 -0.0282 0.0283
quadrupole: 18.1071 -4.7111 -13.3959 -9.2792 -0.0282 0.0283
hfenergy: -775.9137575 hartree
pointgroup: C01 [X(C13H13N5)]
dipole: 1.3970261 0.7710717 -0.0411574 debye
polarizability: 306.5418697|1.6222674|177.7179896|1.5950629|-6.6052414|77.1891951 unknown
InChI: InChI=1S/C13H13N5/c1-2-14-12-11-8-17-18(13(11)16-9-15-12)10-6-4-3-5-7-10/h3-9,14H,2H2,1H3
charge 0 multiplicity 1
31 atoms
N  -0.967868 0.535202 -0.033288
N  3.760834 0.49895 0.001521
N  -0.549603 1.879584 -0.1178
N  0.140961 -1.689597 0.121219
N  2.594402 -1.538958 0.129528
C  1.298579 0.509107 -0.015691
C  0.132589 -0.320927 0.030411
C  2.564453 -0.167407 0.038028
C  -2.374022 0.244736 -0.02569
C  0.805321 1.850448 -0.107369
C  5.06765 -0.186377 0.057228
C  -2.829916 -1.095168 0.057003
C  -3.2962 1.318326 -0.102165
C  1.399431 -2.205394 0.164827
C  6.210216 0.839414 -0.016197
C  -4.218143 -1.348196 0.061958
C  -4.678662 1.043506 -0.095614
C  -5.149365 -0.287961 -0.01378
H  1.343557 2.79554 -0.165879
H  3.751562 1.516981 -0.062733
H  5.127425 -0.778634 0.989547
H  5.131875 -0.910873 -0.775898
H  -2.102896 -1.908701 0.115304
H  -2.918806 2.341188 -0.165075
H  1.469664 -3.295149 0.238114
H  6.178957 1.412297 -0.961537
H  6.168529 1.551887 0.828629
H  7.183628 0.322438 0.030048
H  -4.569794 -2.383892 0.125845
H  -5.390071 1.874587 -0.154992
H  -6.224984 -0.494558 -0.009103
