program: Gaussian 09
title: 000219757
version: EM64L-G09RevD.01
frameworkgroup: C1[X(C15H17N5)]
method: RPBEPBE
basis: SDD
operation: Freq
keyword: #pfreq=noraman
keyword: PBEPBE/SDD
title: #p freq=noraman PBEPBE/SDD
converged: YES YES NO NO
title: Mulliken charges:
elementType: N N N N N C C C C C C C C C C C C C C C H H H H H H H H H H H H H H H H H
charge: -0.119143 -0.268231 -0.109704 -0.028461 -0.067685 0.245274 0.019715 -0.393950 -0.356947 0.119800 -0.395497 0.406761 -0.664631 -0.664633 -0.391229 -0.351079 -0.401650 -0.228978 -0.204946 -0.247855 0.231213 0.237990 0.206633 0.264439 0.267453 0.246436 0.222905 0.220646 0.255144 0.204705 0.218431 0.244994 0.317800 0.285565 0.225399 0.226173 0.227144
chargesum: 0.00000
title: Mulliken charges with hydrogens summed into heavy atoms:
elementType: N N N N N C C C C C C C C C C C C C C C
charge: -0.119143 -0.268231 -0.109704 -0.028461 -0.067685 0.245274 0.019715 0.075252 0.114125 0.119800 -0.128044 0.406761 0.025355 0.013647 -0.146235 -0.033280 -0.116085 -0.003579 0.021227 -0.020711
polarizability: 3.37836772e+02 -1.56526200e+00 2.01376530e+02 1.26656247e+00 1.01070393e+01 9.84990059e+01
1716.lowfreq: -5.0523 -0.0002 0.0006 0.0007 2.2539 10.7203 35.7733 38.1222 58.7218
frequency: 35.7705 38.0634 58.7140 67.6287 97.8254 101.8975 131.5448 150.8273 203.6188 206.7392 220.6958 237.7040 263.7510 283.6744 311.4437 321.5422 335.4686 382.5422 407.6698 411.0412 497.0252 507.3111 522.5975 558.5512 593.1921 604.2234 615.7041 636.3292 661.2946 676.8052 702.9654 704.0717 771.7908 772.5335 785.9080 789.3428 819.2598 833.2985 861.1606 883.7954 931.3176 936.2147 941.8636 953.4485 987.2232 992.4573 1004.4937 1007.2934 1024.6554 1044.4928 1063.5772 1074.8396 1081.3543 1095.6387 1097.9473 1122.0579 1171.0882 1180.7966 1190.3117 1211.7220 1234.9965 1259.6349 1291.6568 1301.2243 1308.6165 1330.0249 1340.0927 1346.6679 1359.0000 1373.8897 1384.7302 1386.1896 1391.7218 1395.6144 1419.2374 1447.6039 1449.7089 1467.9671 1470.1019 1476.4945 1484.1705 1486.3655 1490.0747 1497.6617 1516.7237 1573.5289 1595.5715 1613.0976 2984.8431 2988.1716 3004.1683 3011.8920 3060.8078 3071.9507 3085.5619 3092.2250 3097.5819 3106.0889 3128.3132 3140.4612 3154.5138 3159.6408 3174.0642 3188.2964 3229.3195
redmass: 4.6956 3.5336 4.1902 3.0134 3.4732 4.2843 3.6919 3.6829 1.8065 6.0980 1.0454 1.9966 4.1980 4.0292 3.5760 4.0795 3.4897 2.7962 5.1618 2.9908 3.9422 3.4783 3.2293 3.8305 5.1930 5.8225 6.6510 6.4301 7.1672 10.3266 2.1363 6.5493 1.5959 1.4382 1.9891 1.9079 2.3777 1.5031 1.2466 4.3378 2.1594 1.4401 1.4033 4.7725 6.2031 1.3409 3.5269 1.3001 2.5935 3.2631 2.8761 2.1025 1.8695 1.6779 1.7629 4.4701 1.0589 1.9782 1.2105 2.3490 2.3607 2.6472 1.3632 1.9584 2.4143 1.4808 2.6134 1.4825 1.4492 2.3614 1.2280 5.8703 1.3589 3.3346 2.3975 2.2816 1.3371 1.0464 1.0491 1.6168 1.0544 1.3284 2.7649 1.2646 6.5150 5.4552 6.9073 5.9385 1.0361 1.0358 1.0649 1.0620 1.1009 1.0989 1.0993 1.0969 1.1014 1.1019 1.0853 1.0908 1.0919 1.0966 1.0970 1.0951 1.0967
irintensity: 1.4138 0.0209 0.0394 0.3463 0.3692 0.6266 1.9991 0.8004 0.1633 0.3850 0.3974 0.4174 0.3062 0.4911 1.6636 2.3588 1.4762 2.4871 4.9927 0.0241 2.7291 6.0329 1.4960 5.2978 3.3092 2.1486 1.6378 2.1563 20.1725 8.4183 37.5679 14.5572 44.9742 25.1019 17.1694 14.8367 32.0688 10.6669 0.0002 19.9146 1.8459 12.9405 8.4304 43.1746 2.3817 0.3219 32.2435 2.7953 0.2402 16.0648 11.2385 15.1739 46.1327 21.5490 5.3112 29.7686 0.0561 0.5991 7.0773 8.5931 45.8029 6.9703 26.9662 14.1340 7.9719 16.0552 285.0261 70.8683 10.6208 5.5641 18.3074 1.3338 36.9972 84.4119 2.9715 5.3559 48.4990 3.4791 18.6213 15.2707 8.2255 7.6484 237.1657 25.8973 94.8453 711.4843 11.7937 31.4104 33.8079 24.1863 45.0014 42.2745 5.2712 22.2273 33.7432 30.9042 40.6029 27.6988 0.0158 26.2521 20.7879 23.9291 32.2634 4.5533 2.9654
temp: 298.150 k
press: 1.00000 atm
elementType: 7 7 7 7 7 6 6 6 6 6 6 6 6 6 6 6 6 6 6 6 1 1 1 1 1 1 1 1 1 1 1 1 1 1 1 1 1
symmnumber: 1
zpe: 786834.1 jmol-1
zpe.correction: 0.299689 hartree
zpe.thermalcorrener: 0.317161 hartree
zpe.thermalcorrenthalpy: 0.318105 hartree
zpe.thermalcorrgfe: 0.253669 hartree
zpe.sumelectzpe: -854.108995 hartree
zpe.sumelectthermal: -854.091523 hartree
zpe.sumelectthermalent: -854.090579 hartree
zpe.sumelectthermalfe: -854.155015 hartree
dipole: -3.9975 1.8191 0.2686
dipole: 4.4002
quadrupole: -94.8557 -114.2475 -122.5637
quadrupole: -7.4583 -0.6091 1.0026
quadrupole: 15.6999 -3.6919 -12.0080 -7.4583 -0.6091 1.0026
hfenergy: -854.4086841 hartree
pointgroup: C01 [X(C15H17N5)]
dipole: 1.5861369 0.6055595 0.3381761 debye
polarizability: 336.8135079|8.4662072|156.6414293|-13.2038544|51.5681893|144.2573713 unknown
InChI: InChI=1S/C15H17N5/c1-3-19(4-2)14-13-10-18-20(15(13)17-11-16-14)12-8-6-5-7-9-12/h5-11H,3-4H2,1-2H3
charge 0 multiplicity 1
37 atoms
N  3.430503 0.19596 -0.116233
N  -1.321088 0.332026 0.384548
N  2.066937 -1.371448 -1.203487
N  -0.82156 1.35979 1.208401
N  -0.379013 -1.418179 -1.092256
C  2.162583 -0.278092 -0.364028
C  0.946452 0.280443 0.179407
C  3.692838 1.418932 0.670776
C  4.610028 -0.503598 -0.689212
C  -0.278144 -0.346034 -0.246147
C  0.524118 1.319297 1.080362
C  -2.741181 0.130951 0.312092
C  3.844457 1.15007 2.185311
C  4.992989 0.026214 -2.086901
C  0.836344 -1.86786 -1.507771
C  -3.285204 -0.903467 -0.490848
C  -3.590168 0.987259 1.057674
C  -4.685938 -1.070482 -0.5390
C  -4.986409 0.803658 0.995407
C  -5.544251 -0.223931 0.198708
H  4.62503 1.86602 0.279129
H  2.893521 2.15531 0.478262
H  5.448015 -0.373043 0.021618
H  4.369039 -1.575975 -0.756555
H  1.109344 2.032418 1.655813
H  2.925416 0.709601 2.608476
H  4.675908 0.448283 2.376795
H  4.060573 2.090998 2.724085
H  4.172533 -0.165276 -2.798414
H  5.200948 1.112082 -2.069599
H  5.899519 -0.489132 -2.45389
H  0.826175 -2.735406 -2.175079
H  -2.614713 -1.552917 -1.05817
H  -3.146446 1.775752 1.669127
H  -5.104911 -1.870093 -1.16007
H  -5.640123 1.467078 1.572575
H  -6.630124 -0.361412 0.15439
