program: Gaussian 09
title: 000219750
version: EM64L-G09RevD.01
frameworkgroup: C1[X(C13H12N4O)]
method: RPBEPBE
basis: SDD
operation: Freq
keyword: #p
keyword: freq=noraman
keyword: PBEPBE/SDD
title: #p freq=noraman PBEPBE/SDD
converged: NO YES NO NO
title: Mulliken charges:
elementType: O N N N N C C C C C C C C C C C C C H H H H H H H H H H H H
charge: -0.246429 -0.278166 -0.001898 -0.067564 -0.081550 0.126620 0.037484 0.401353 -0.408897 0.158931 0.035807 -0.355806 -0.400369 -0.226151 -0.203910 -0.745145 -0.246722 -0.505907 0.281625 0.312513 0.287523 0.225963 0.228481 0.245156 0.239325 0.239140 0.228756 0.242774 0.242806 0.234256
chargesum: 0.00000
title: Mulliken charges with hydrogens summed into heavy atoms:
elementType: O N N N N C C C C C C C C C C C C C
charge: -0.246429 -0.278166 -0.001898 -0.067564 -0.081550 0.126620 0.037484 0.401353 -0.127272 0.158931 0.035807 -0.043293 -0.112846 -0.000188 0.024571 -0.021525 -0.017966 0.213929
polarizability: 2.82674760e+02 -7.15664734e-02 1.87153657e+02 1.14629337e-01 2.92578475e-01 7.48245748e+01
1716.lowfreq: -4.5241 -2.3444 -0.0005 0.0001 0.0004 9.8950 42.3017 46.3048 69.5811
frequency: 42.1968 46.2947 69.5616 105.6716 112.5019 133.8345 139.9652 180.4436 202.0077 226.5936 260.4598 280.9310 286.7527 365.4865 371.6311 410.8523 413.8197 478.6512 514.2777 557.8029 606.1562 617.4728 626.6801 647.8920 662.8912 670.8855 700.3168 702.8778 772.6936 785.8613 803.9580 850.1352 860.8792 902.9550 928.0556 941.8186 981.5264 987.6925 993.4366 1000.0544 1005.0061 1023.7356 1041.7306 1048.2968 1086.9151 1102.1887 1112.1081 1153.9591 1171.8412 1176.1857 1191.6499 1255.3294 1286.5743 1306.6372 1323.5677 1338.6298 1379.8439 1388.0093 1396.7637 1400.4304 1422.9556 1442.2480 1450.6488 1451.1720 1455.9772 1463.0097 1468.3916 1493.8772 1514.6027 1587.6848 1597.0828 1614.9632 2998.0033 3008.7101 3078.9633 3113.3605 3130.4103 3132.6992 3142.0946 3150.0153 3161.2635 3174.4961 3189.1926 3236.2225
redmass: 3.9814 4.4621 1.0408 4.7383 3.1787 2.5498 1.4094 3.5459 4.6678 6.3977 3.7163 5.6129 7.0738 5.4181 3.5288 2.9732 5.6663 6.6438 3.3066 6.7025 6.8114 6.6720 7.1122 4.0316 5.2800 10.7314 7.0411 2.0780 1.6645 4.2326 7.7820 1.5163 1.2471 8.0541 6.9110 1.4063 6.1801 6.2218 1.3483 2.0401 1.3001 2.7512 2.6779 1.5956 2.5292 2.1487 1.2547 1.4946 1.0873 1.6651 1.1851 4.0565 6.3674 5.3612 1.5817 2.9816 3.2959 2.0980 3.5034 6.1592 2.1284 1.9009 1.0510 2.1950 1.0482 1.0618 1.2911 2.8855 6.7578 9.3557 6.9403 6.0285 1.0377 1.0289 1.0968 1.1047 1.0853 1.0997 1.0907 1.1054 1.0964 1.0971 1.0953 1.0982
irintensity: 0.4954 1.2137 0.4082 1.6834 1.4850 1.9846 1.2201 2.9539 2.6435 0.0167 0.6172 0.2226 7.5107 0.3174 14.6756 0.0029 1.2085 0.0950 7.0945 5.3894 1.3645 0.0038 1.2765 2.0318 31.3526 8.4240 9.4552 38.0304 60.7343 26.7428 11.9113 15.4710 0.0899 3.1061 42.7592 10.2239 56.2747 0.5489 0.2233 6.8409 2.3248 2.7955 35.5362 5.8140 40.8466 21.0456 0.0633 19.5187 4.3347 46.6858 20.3168 14.2230 4.1001 93.5370 46.7800 295.6905 22.6162 2.6935 149.9735 98.9201 6.7628 27.4163 12.5549 20.2567 18.4657 42.2768 10.8939 213.2692 145.7791 279.0434 8.8534 25.3703 10.3633 50.1446 12.1088 24.5192 0.0159 10.9710 24.5284 19.9031 20.8517 25.9422 4.4037 1.2781
temp: 298.150 k
press: 1.00000 atm
elementType: 8 7 7 7 7 6 6 6 6 6 6 6 6 6 6 6 6 6 1 1 1 1 1 1 1 1 1 1 1 1
symmnumber: 1
zpe: 603584.3 jmol-1
zpe.correction: 0.229893 hartree
zpe.thermalcorrener: 0.245092 hartree
zpe.thermalcorrenthalpy: 0.246036 hartree
zpe.thermalcorrgfe: 0.186752 hartree
zpe.sumelectzpe: -795.536210 hartree
zpe.sumelectthermal: -795.521011 hartree
zpe.sumelectthermalent: -795.520067 hartree
zpe.sumelectthermalfe: -795.579351 hartree
dipole: 2.1478 0.8789 0.0015
dipole: 2.3206
quadrupole: -82.0263 -99.0193 -107.9015
quadrupole: -1.7916 0.0395 0.1149
quadrupole: 14.2894 -2.7036 -11.5858 -1.7916 0.0395 0.1149
hfenergy: -795.7661031 hartree
pointgroup: C01 [X(C13H12N4O1)]
dipole: -0.8389398 0.3600291 0.0123062 debye
polarizability: 282.6468322|-1.5930618|187.0019336|0.6356133|4.4700839|75.0042254 unknown
InChI: InChI=1S/C13H12N4O/c1-9-15-12-11(13(16-9)18-2)8-14-17(12)10-6-4-3-5-7-10/h3-8H,1-2H3
charge 0 multiplicity 1
30 atoms
O  -3.863842 -1.182459 -0.095548
N  0.774992 -0.699164 -0.06047
N  0.487061 -2.082668 -0.122679
N  -0.553828 1.405751 0.030087
N  -2.964487 1.004875 0.006354
C  -0.402338 0.045633 -0.030499
C  -1.479781 -0.89919 -0.07527
C  2.147558 -0.278387 -0.037255
C  -0.862356 -2.187951 -0.129596
C  -2.783954 -0.33216 -0.054118
C  -1.848794 1.825234 0.04646
C  2.476703 1.099818 0.010684
C  3.165574 -1.26411 -0.06433
C  3.835478 1.479894 0.030726
C  4.516448 -0.862986 -0.043433
C  -2.113377 3.307062 0.111094
C  4.861127 0.508101 0.003889
C  -5.210413 -0.56091 -0.071086
H  -1.3243 -3.171296 -0.174176
H  1.678321 1.845169 0.032052
H  2.884476 -2.318604 -0.101461
H  4.090059 2.544925 0.067476
H  5.302011 -1.626246 -0.06407
H  -1.164766 3.860045 0.170945
H  -2.674866 3.634874 -0.782342
H  -2.73947 3.546259 0.988979
H  5.91285 0.813431 0.019652
H  -5.341998 0.103012 -0.941113
H  -5.345731 0.024237 0.853194
H  -5.901257 -1.414789 -0.110149
