program: Gaussian 09
title: 000219748
version: EM64L-G09RevD.01
frameworkgroup: C1[X(C14H15N5)]
method: RPBEPBE
basis: SDD
operation: Freq
keyword: #pfreq=noraman
keyword: PBEPBE/SDD
title: #p freq=noraman PBEPBE/SDD
converged: NO YES NO NO
title: Mulliken charges:
elementType: N N N N N C C C C C C C C C C C C C C H H H H H H H H H H H H H H H
charge: -0.182200 -0.395582 -0.062953 -0.093713 -0.016510 0.006397 0.136860 0.206854 -0.461090 -0.427567 0.379655 0.029855 -0.616788 -0.387702 -0.388724 -0.749855 -0.224059 -0.224012 -0.232894 0.242016 0.241680 0.328068 0.258790 0.243465 0.243572 0.261200 0.240860 0.240639 0.243339 0.234179 0.234204 0.229898 0.229893 0.232227
chargesum: 0.00000
title: Mulliken charges with hydrogens summed into heavy atoms:
elementType: N N N N N C C C C C C C C C C C C C C
charge: -0.182200 -0.067514 -0.062953 -0.093713 -0.016510 0.006397 0.136860 0.206854 0.022606 -0.168778 0.379655 0.029855 0.131449 -0.146841 -0.148085 -0.038134 0.005839 0.005880 -0.000667
polarizability: 2.65815119e+02 -9.95688342e+00 1.79689833e+02 -2.68446598e-01 -1.77636453e-01 1.27839446e+02
1716.lowfreq: -25.6046 -3.9984 -0.0007 0.0003 0.0007 4.2279 11.8607 24.7484 46.7682
frequency: -25.5203 24.5161 46.7678 61.7508 73.2477 102.6061 121.5701 125.4857 161.8765 197.1340 213.3698 227.1525 265.3573 312.7661 328.0571 349.5646 351.3621 403.0814 461.1773 471.2609 503.3521 517.4650 552.8260 608.3327 615.4350 617.6143 645.2691 667.1486 682.6616 705.2616 726.0752 761.3323 784.7967 821.4065 824.2491 830.9371 857.0017 924.4700 935.8302 942.7077 967.9014 979.5255 990.2082 996.7694 998.8272 1026.7170 1048.8011 1052.8221 1087.1351 1097.2680 1128.5442 1161.7927 1173.6474 1187.3700 1198.3587 1217.0610 1219.5138 1221.4078 1271.6051 1316.8138 1324.0820 1327.1852 1366.0243 1381.6962 1383.0230 1399.9753 1415.9330 1417.1992 1438.7848 1444.0876 1456.4300 1468.9273 1469.1688 1481.3451 1483.9743 1488.2778 1498.0467 1544.6129 1592.0870 1593.6190 1615.6861 2994.2441 2995.0235 3003.1031 3041.0713 3075.9465 3094.7568 3120.7199 3121.9091 3124.0554 3128.1716 3135.0783 3147.9658 3164.3694 3210.5089 3573.3532
redmass: 3.7371 4.0481 5.2291 2.9776 1.1161 1.0875 3.9258 5.1459 3.5431 3.7765 4.4435 3.6790 6.3263 2.1729 3.6066 3.3914 5.7044 2.7653 1.1689 5.3614 3.8169 5.7744 5.1951 4.5164 5.8526 6.3453 4.1141 11.2051 5.2842 1.9720 4.8006 2.0261 3.0168 5.8453 1.8126 3.9525 1.2436 1.4518 5.9630 1.6108 2.4052 1.3884 6.2255 2.2213 1.4496 2.2053 1.5933 3.1080 1.5228 4.8220 1.3103 1.8839 1.0541 1.1163 1.1073 2.4800 2.3614 2.8856 8.9862 1.6555 1.2760 5.4850 3.5643 1.5224 8.4919 2.9044 2.1113 1.7258 2.1803 1.7464 1.0472 1.0464 1.2125 1.5521 1.6759 1.3993 2.3083 7.0503 6.7501 6.0813 6.1643 1.0586 1.0378 1.0330 1.1037 1.0969 1.1025 1.0857 1.0885 1.1015 1.0998 1.0916 1.0961 1.1016 1.0973 1.0782
irintensity: 0.2283 0.0134 0.0703 1.4711 1.5708 0.0007 0.2465 0.2222 1.6591 1.5231 1.1449 3.2015 13.1840 4.3260 10.3083 2.6458 4.3702 0.5970 58.4651 3.5776 10.7791 2.0827 0.8252 13.3103 0.4876 0.2011 1.5371 1.2913 34.3973 40.2645 31.1851 40.5784 25.1668 6.5530 10.2017 7.2513 0.2319 3.6465 14.5355 1.6953 0.4375 0.0327 0.1489 9.8863 3.7237 9.0443 5.3674 0.0864 8.4428 37.1941 0.9343 3.7332 0.0205 1.8476 0.2882 2.7584 11.9283 30.8385 12.0415 13.2624 0.2516 191.2336 31.5329 4.0228 0.0597 131.9086 3.2885 47.9983 8.5602 125.1591 14.0913 17.8285 70.2357 31.3239 6.2382 0.4650 17.1870 242.9107 650.1134 1.4730 8.1882 23.6174 20.8031 56.2508 13.1499 14.9610 19.9538 6.8550 2.2916 3.3374 14.7201 12.9459 36.5339 22.1140 3.2075 68.2149
temp: 298.150 k
press: 1.00000 atm
elementType: 7 7 7 7 7 6 6 6 6 6 6 6 6 6 6 6 6 6 6 1 1 1 1 1 1 1 1 1 1 1 1 1 1 1
symmnumber: 1
zpe: 709892.8 jmol-1
zpe.correction: 0.270384 hartree
zpe.thermalcorrener: 0.286590 hartree
zpe.thermalcorrenthalpy: 0.287534 hartree
zpe.thermalcorrgfe: 0.225208 hartree
zpe.sumelectzpe: -814.899292 hartree
zpe.sumelectthermal: -814.883086 hartree
zpe.sumelectthermalent: -814.882142 hartree
zpe.sumelectthermalfe: -814.944468 hartree
dipole: 2.7518 -0.4845 -0.0015
dipole: 2.7941
quadrupole: -96.8286 -116.5631 -106.7434
quadrupole: -5.8100 -0.0582 -0.0652
quadrupole: 9.8831 -9.8514 -0.0317 -5.8100 -0.0582 -0.0652
hfenergy: -815.169676 hartree
pointgroup: C01 [X(C14H15N5)]
dipole: -1.0840116 -0.1826297 -0.0008786 debye
polarizability: 265.9576682|9.3209239|179.54835|0.004921|-0.10429|127.838379 unknown
InChI: InChI=1S/C14H15N5/c1-10-17-13(12-9-16-19(2)14(12)18-10)15-8-11-6-4-3-5-7-11/h3-7,9,15H,8H2,1-2H3
charge 0 multiplicity 1
34 atoms
N  3.81619 -1.392913 0.019637
N  -0.686942 0.011819 0.007063
N  3.418571 1.036663 0.000174
N  1.03628 1.609093 -0.005054
N  3.060304 -2.571797 0.028792
C  1.658058 -0.737353 0.014223
C  3.008763 -0.268698 0.010653
C  0.656385 0.293091 0.005509
C  -1.725261 1.067839 -0.003779
C  1.757631 -2.167475 0.025556
C  -3.109238 0.438962 -0.007024
C  2.381306 1.923291 -0.007271
C  5.275732 -1.438656 0.021459
C  -3.751378 0.114816 -1.229799
C  -3.772127 0.146555 1.212623
C  2.716409 3.394676 -0.019327
C  -5.028848 -0.489916 -1.235006
C  -5.049731 -0.45802 1.21176
C  -5.680739 -0.778276 -0.013109
H  -1.574228 1.70901 -0.892124
H  -1.583276 1.719771 0.87822
H  -0.99229 -0.961595 0.014999
H  0.97766 -2.927717 0.031374
H  5.643128 -1.948645 0.927748
H  5.643699 -1.976769 -0.868069
H  5.639791 -0.399519 0.005643
H  -3.250282 0.344164 -2.178427
H  -3.287134 0.40042 2.163364
H  3.807775 3.532831 -0.019795
H  2.280111 3.879737 -0.911028
H  2.278921 3.894561 0.863547
H  -5.515738 -0.730538 -2.186681
H  -5.552801 -0.673916 2.160953
H  -6.673102 -1.243094 -0.015498
