program: Gaussian 09
title: 000219747
version: EM64L-G09RevD.01
frameworkgroup: C1[X(C13H12N4O)]
method: RPBEPBE
basis: SDD
operation: Freq
keyword: #p
keyword: freq=noraman
keyword: PBEPBE/SDD
title: #p freq=noraman PBEPBE/SDD
converged: YES YES NO NO
title: Mulliken charges:
elementType: O N N N N C C C C C C C C C C C C C H H H H H H H H H H H H
charge: -0.236432 -0.228941 -0.247040 -0.122647 -0.018242 0.187909 0.011866 0.444087 -0.269360 0.045880 -0.018745 -0.447385 -0.349021 -0.413953 -0.687673 -0.217600 -0.204047 -0.243921 0.341234 0.301145 0.236591 0.210723 0.321843 0.217387 0.220509 0.234012 0.220984 0.237083 0.235275 0.238476
chargesum: 0.00000
title: Mulliken charges with hydrogens summed into heavy atoms:
elementType: O N N N N C C C C C C C C C C C C C
charge: -0.236432 -0.228941 0.094194 -0.122647 -0.018242 0.187909 0.011866 0.444087 0.031785 0.045880 -0.018745 -0.000070 -0.027177 -0.196566 -0.012167 0.019482 0.031229 -0.005445
polarizability: 2.75866173e+02 -1.00185881e+01 2.00723405e+02 -3.00193009e-01 -2.77930179e+00 7.85661071e+01
1716.lowfreq: -7.2085 -1.9956 -0.0006 -0.0004 0.0004 5.5979 30.5588 37.8339 47.7553
frequency: 30.3306 37.8229 47.7361 90.9952 100.6989 143.8222 190.4630 208.5807 238.7141 248.6865 277.4275 297.9456 325.9063 347.4982 369.6598 404.1935 408.0318 478.7752 497.2317 545.0440 557.1735 610.0207 624.1729 633.7033 674.6652 689.3566 692.3730 711.1468 759.9279 786.7566 794.8600 804.8369 832.6764 859.8769 898.2863 912.8528 950.2540 974.2397 984.0462 991.2150 1003.0004 1014.5909 1029.5984 1055.4945 1073.7920 1092.8269 1099.1463 1101.9785 1178.1783 1199.3289 1215.9358 1235.4409 1271.8976 1284.1481 1306.9698 1322.6473 1336.1409 1371.5216 1377.2298 1382.5565 1422.5343 1447.4548 1454.5828 1457.3327 1472.9987 1487.2578 1495.0297 1525.6595 1569.0657 1584.4309 1595.2492 1611.9640 2984.1675 3012.1131 3077.1232 3084.8329 3103.2323 3126.4610 3141.3549 3152.4683 3165.9821 3175.2075 3241.3748 3602.8713
redmass: 2.6464 3.6183 7.3805 4.2979 4.4627 5.9670 3.8581 1.4466 5.2269 3.1879 9.3944 4.7707 2.9475 5.9530 1.3342 2.9551 4.4413 6.3190 3.2537 6.2237 3.1859 6.4314 6.8566 4.6516 9.9835 6.9440 2.0894 5.2062 1.6981 2.7999 3.2190 1.9390 1.2626 1.6240 5.3833 1.3923 4.3774 1.3716 5.1010 4.0531 1.3558 2.6627 2.1892 2.1829 2.0902 2.9367 1.5166 2.3151 1.0560 1.1574 2.1489 2.0858 2.3949 2.0835 1.6168 3.0660 1.4683 5.4064 1.3513 5.4213 4.1036 2.2036 1.9542 1.3333 1.0455 1.0946 2.6320 6.7227 8.1163 10.3577 7.0101 5.9690 1.0341 1.0618 1.0998 1.0996 1.1023 1.0876 1.0876 1.0930 1.0960 1.1016 1.1003 1.0823
irintensity: 0.4267 0.2805 4.9172 8.0446 1.1878 1.9779 0.3057 0.9680 0.1991 0.2118 3.7650 3.6476 9.0048 8.4804 172.1779 1.2966 2.6303 2.3014 11.6115 1.5794 0.8958 2.6160 0.5599 6.2680 9.8506 19.2600 34.5437 1.4148 75.6511 14.7267 14.3757 3.7749 2.2956 14.1581 12.9425 7.0415 1.6507 1.8641 1.2839 18.7742 1.6010 50.0328 1.9664 38.9249 70.1332 73.0223 22.2383 21.1769 0.0252 3.0512 110.5436 96.9171 134.1728 66.0208 5.7391 100.4790 45.6489 55.3480 49.8937 14.1830 290.3775 66.0718 28.1122 30.1561 5.7426 18.9054 130.1550 59.7236 441.5542 269.1016 83.8181 31.9120 38.6565 18.6109 6.2468 44.9489 41.7083 11.6245 2.1742 21.6554 0.6559 32.7419 9.6455 126.0268
temp: 298.150 k
press: 1.00000 atm
elementType: 8 7 7 7 7 6 6 6 6 6 6 6 6 6 6 6 6 6 1 1 1 1 1 1 1 1 1 1 1 1
symmnumber: 1
zpe: 603965.7 jmol-1
zpe.correction: 0.230038 hartree
zpe.thermalcorrener: 0.245197 hartree
zpe.thermalcorrenthalpy: 0.246141 hartree
zpe.thermalcorrgfe: 0.186383 hartree
zpe.sumelectzpe: -795.514836 hartree
zpe.sumelectthermal: -795.499677 hartree
zpe.sumelectthermalent: -795.498733 hartree
zpe.sumelectthermalfe: -795.558491 hartree
dipole: -10.2346 -1.1702 1.1770
dipole: 10.3683
quadrupole: -120.7403 -88.0727 -107.6042
quadrupole: 17.3134 0.7691 -2.3160
quadrupole: -15.2679 17.3997 -2.1318 17.3134 0.7691 -2.3160
hfenergy: -795.744874 hartree
pointgroup: C01 [X(C13H12N4O1)]
dipole: 4.0075473 -0.5856891 -0.4862774 debye
polarizability: 276.413648|7.6541168|200.1542131|-1.2726467|3.0304421|78.5878237 unknown
InChI: InChI=1S/C13H12N4O/c1-2-11-15-12-10(13(18)16-11)8-14-17(12)9-6-4-3-5-7-9/h3-8,14H,2H2,1H3
charge 0 multiplicity 1
30 atoms
O  -3.818212 -2.071642 -0.036772
N  0.737681 -0.864807 -0.145307
N  0.592738 -2.255068 -0.316296
N  -0.885635 0.948894 0.207745
N  -3.249539 0.204835 0.276003
C  -0.559783 -0.33479 0.002066
C  -1.488288 -1.439157 -0.0904
C  2.023227 -0.247629 -0.072429
C  -0.742045 -2.594874 -0.308195
C  -2.279662 1.134603 0.345183
C  -2.935819 -1.164046 0.046066
C  -2.69523 2.574317 0.557161
C  2.117812 1.160697 -0.216043
C  3.187999 -1.031553 0.135553
C  -2.654107 3.374393 -0.772542
C  3.38866 1.768519 -0.172719
C  4.451421 -0.403855 0.163629
C  4.560214 0.996125 0.005237
H  1.387571 -2.799486 -0.645982
H  -1.065471 -3.622203 -0.458379
H  -3.717422 2.579954 0.96909
H  -2.007118 3.041167 1.285722
H  1.201886 1.746048 -0.331124
H  3.129805 -2.109933 0.323703
H  -2.946526 4.425484 -0.598499
H  -3.353041 2.938411 -1.508149
H  -1.637717 3.362509 -1.205093
H  3.460691 2.85578 -0.281741
H  5.348117 -1.010914 0.326555
H  5.542492 1.478521 0.031956
