program: Gaussian 09
title: 000219746
version: EM64L-G09RevD.01
frameworkgroup: C1[X(C12H9ClN4O)]
method: RPBEPBE
basis: SDD
operation: Freq
keyword: #p
keyword: freq=noraman
keyword: PBEPBE/SDD
title: #p freq=noraman PBEPBE/SDD
converged: YES YES NO NO
title: Mulliken charges:
elementType: Cl O N N N N C C C C C C C C C C C C H H H H H H H H H
charge: -0.062931 -0.234339 -0.226917 -0.225332 -0.156233 -0.028342 0.224343 0.009374 0.570086 -0.262701 -0.013711 -0.327145 -0.337705 0.055177 -0.200114 -0.247932 -0.233314 -0.753870 0.320976 0.303564 0.354696 0.262174 0.243302 0.246046 0.231230 0.231694 0.257922
chargesum: 0.00000
title: Mulliken charges with hydrogens summed into heavy atoms:
elementType: Cl O N N N N C C C C C C C C C C C C
charge: -0.062931 -0.234339 -0.226917 0.095644 -0.156233 -0.028342 0.224343 0.009374 0.570086 0.040863 -0.013711 -0.327145 0.016991 0.055177 0.062060 -0.004630 0.012732 -0.033023
polarizability: 2.74896003e+02 1.35636411e+01 2.09474101e+02 -1.70368000e-03 1.76537296e-02 6.78871003e+01
1716.lowfreq: -8.2171 -5.3341 0.0015 0.0017 0.0022 2.8587 7.7913 51.7695 91.0361
frequency: 7.7606 51.7639 91.0351 95.1624 123.6064 139.4242 180.1345 206.0288 216.7814 264.3245 270.2009 309.7103 322.9094 337.2635 374.6389 447.9405 448.7488 482.4666 483.6915 519.9991 549.1369 582.5803 620.9112 623.3012 636.1336 646.9318 679.1491 701.3682 702.5489 767.5921 787.8899 805.1004 871.5712 883.1100 910.1155 963.2912 965.5608 976.9359 1009.6928 1023.8340 1042.8056 1045.7693 1072.2667 1087.8343 1100.9908 1132.6525 1182.3222 1225.6084 1252.7229 1289.7596 1297.3852 1319.6125 1348.4487 1371.7792 1383.0537 1414.5939 1428.6529 1458.0148 1461.3353 1468.1271 1499.3905 1532.4289 1565.0905 1569.1641 1589.5303 1610.5959 2991.7069 3070.9606 3087.4309 3138.7898 3151.4923 3164.5959 3181.5147 3242.8413 3460.1574
redmass: 7.2066 7.3230 1.0834 4.2293 5.5238 5.2481 5.6269 13.2040 7.5268 8.0621 6.3507 3.5645 6.4167 7.5342 7.2227 3.6987 6.3017 7.1187 1.8948 3.6407 7.9767 1.8266 3.4107 7.0919 5.5675 7.3717 9.9399 7.9479 4.5557 1.2172 5.1626 7.1752 1.5289 1.3180 7.7161 7.0568 1.3424 2.3744 6.9713 1.2948 2.6334 1.6165 2.2738 3.3888 3.1739 1.5222 1.0901 2.3037 3.2743 1.9923 2.2159 5.0911 6.2895 4.6244 1.3001 2.9953 2.4473 1.0483 1.7366 1.7108 2.6572 5.9565 6.4682 7.1911 12.0095 6.2882 1.0381 1.0965 1.0960 1.0991 1.0876 1.0929 1.1004 1.1004 1.0860
irintensity: 1.0425 3.7583 0.0127 7.2931 3.4684 1.5744 0.4915 2.9799 2.5993 3.9895 0.0021 2.7227 0.3647 4.3137 5.7843 7.7639 2.6149 5.4830 71.0631 3.4301 1.0890 27.4618 0.0068 1.3537 14.5137 6.4012 7.2325 26.4424 2.3577 84.2670 24.4111 11.3911 9.4306 5.2083 6.2981 26.3014 3.4314 35.2153 53.5954 3.7362 0.0920 6.9111 36.0769 18.4817 102.1029 11.5664 2.7159 43.9035 371.1201 22.6194 118.7816 83.3301 104.0933 26.5486 50.2319 220.6879 60.9988 17.5952 24.1263 230.8096 67.4193 65.8643 84.0278 314.0367 346.3513 17.5627 8.0564 15.3254 83.3409 12.0860 0.6031 6.8713 11.4486 12.5861 544.7285
temp: 298.150 k
press: 1.00000 atm
elementType: 17 8 7 7 7 7 6 6 6 6 6 6 6 6 6 6 6 6 1 1 1 1 1 1 1 1 1
symmnumber: 1
zpe: 504344.2 jmol-1
zpe.correction: 0.192095 hartree
zpe.thermalcorrener: 0.207074 hartree
zpe.thermalcorrenthalpy: 0.208018 hartree
zpe.thermalcorrgfe: 0.147882 hartree
zpe.sumelectzpe: -1215.678551 hartree
zpe.sumelectthermal: -1215.663572 hartree
zpe.sumelectthermalent: -1215.662628 hartree
zpe.sumelectthermalfe: -1215.722763 hartree
dipole: 9.9214 0.9735 -0.0163
dipole: 9.9691
quadrupole: -137.2853 -96.4033 -113.4322
quadrupole: -7.8867 -0.0799 -0.0044
quadrupole: -21.5784 19.3036 2.2747 -7.8867 -0.0799 -0.0044
hfenergy: -1215.8706454 hartree
pointgroup: C01 [X(C12H9Cl1N4O1)]
dipole: 3.914169 -0.2460089 0.0441861 debye
polarizability: 277.4807789|2.5900155|206.7477896|2.2507781|-4.0087537|68.0286355 unknown
InChI: InChI=1S/C12H9ClN4O/c1-7-15-11-8(12(18)16-7)6-14-17(11)10-5-3-2-4-9(10)13/h2-6,14H,1H3
charge 0 multiplicity 1
27 atoms
Cl 3.053321 -2.677252 0.15432
O  -4.252689 -1.452287 0.014901
N  0.398597 -0.652793 0.04897
N  0.119712 -2.035032 0.078767
N  -1.091033 1.326373 -0.017892
N  -3.510107 0.794275 -0.031803
C  -0.861841 0.004476 0.018046
C  -1.878691 -1.015673 0.031589
C  1.715624 -0.097736 0.046065
C  -1.230876 -2.25017 0.069107
C  -3.300634 -0.615413 0.005312
C  2.939485 -0.825699 0.086551
C  1.814685 1.32567 -0.001564
C  -2.469382 1.64217 -0.04094
C  4.190743 -0.181545 0.079167
C  3.062888 1.970201 -0.008621
C  4.262038 1.225395 0.031201
C  -2.759175 3.122747 -0.079549
H  0.901589 -2.696931 0.108192
H  -1.641492 -3.256814 0.089461
H  0.874678 1.889541 -0.030775
H  5.100713 -0.787237 0.111272
H  3.09221 3.063629 -0.045646
H  5.237673 1.720169 0.025797
H  -2.288735 3.581783 -0.968295
H  -2.32559 3.620444 0.807292
H  -3.84521 3.289005 -0.104926
