program: Gaussian 09
title: 000219744
version: EM64L-G09RevD.01
frameworkgroup: C1[X(C13H12N4O)]
method: RPBEPBE
basis: SDD
operation: Freq
keyword: #p
keyword: freq=noraman
keyword: PBEPBE/SDD
title: #p freq=noraman PBEPBE/SDD
converged: YES YES NO NO
title: Mulliken charges:
elementType: O N N N N C C C C C C C C C C C C C H H H H H H H H H H H H
charge: -0.236716 -0.221896 -0.248332 -0.121300 -0.031061 0.180528 0.018345 0.449332 -0.267862 -0.352453 -0.412007 -0.015767 0.451564 -0.352793 -0.407937 0.054574 -0.803187 -0.753371 0.340572 0.300090 0.320363 0.215204 0.238474 0.238493 0.225366 0.234274 0.239043 0.230202 0.232733 0.255524
chargesum: 0.00000
title: Mulliken charges with hydrogens summed into heavy atoms:
elementType: O N N N N C C C C C C C C C C C C C
charge: -0.236716 -0.221896 0.092240 -0.121300 -0.031061 0.180528 0.018345 0.449332 0.032228 -0.032090 -0.196803 -0.015767 0.451564 -0.114319 -0.169443 0.054574 -0.104504 -0.034912
polarizability: 2.98814465e+02 4.05534299e+00 1.92139607e+02 1.55076822e+00 -4.17337704e+00 7.80431815e+01
1716.lowfreq: -8.9559 -0.1093 -0.0007 0.0002 0.0007 4.8408 34.4084 40.4796 45.4493
frequency: 34.3527 40.4750 45.3233 82.5836 85.1881 108.5116 140.1181 184.0495 223.0242 243.7324 260.8471 296.4279 313.0699 332.6595 362.0881 374.8488 406.0181 412.9436 471.7348 503.1749 539.9226 554.6260 587.7524 619.3349 629.9324 640.8272 664.7504 675.7987 712.2687 779.0305 785.3765 802.4548 811.5014 850.4790 857.4796 912.6129 937.1025 967.5972 981.8329 986.0649 992.3301 1011.8466 1044.9704 1048.9353 1073.5242 1082.9088 1089.6182 1135.5967 1203.2783 1222.6036 1228.3150 1259.5029 1283.5960 1314.9296 1323.8300 1367.9948 1373.1074 1382.8958 1401.0268 1411.5762 1424.9798 1453.8977 1457.0042 1464.1631 1470.1385 1477.0747 1511.8627 1527.7100 1570.4376 1582.5426 1591.0709 1624.8151 2979.5374 2991.7872 3058.6463 3070.8305 3087.5512 3121.6494 3133.2016 3138.6545 3146.1084 3166.6679 3241.6658 3603.1761
redmass: 3.7439 3.2147 1.2321 4.0843 1.0691 4.8949 4.5325 5.2873 5.7132 4.6042 8.0544 5.5506 3.7029 3.0575 4.4173 1.3878 2.9031 4.2834 6.5960 2.7423 6.6330 3.1480 5.7254 3.5277 6.3582 5.7285 7.6143 10.8510 3.0940 5.2202 4.3136 1.7045 3.9726 1.3012 1.6396 7.4111 1.3429 5.3858 2.5488 1.3700 1.3842 2.7970 1.6217 1.5546 1.9271 3.7675 3.5205 1.3109 1.1471 2.8844 2.6783 4.9559 2.0402 4.4578 1.5101 5.5440 5.6074 1.3300 1.2426 3.4040 2.6587 2.1946 1.0548 1.4904 1.0482 1.1474 2.8251 5.6887 8.1041 8.2260 8.5541 6.2173 1.0375 1.0381 1.0973 1.0964 1.0991 1.0874 1.0905 1.0993 1.0964 1.0965 1.1003 1.0823
irintensity: 0.7339 1.4889 2.5720 5.5175 0.1055 8.1543 0.9673 0.2200 0.1343 0.6846 3.2111 2.2042 2.7602 13.2753 5.7059 176.0528 0.4431 0.2933 2.0348 23.4209 1.3944 1.2674 0.9916 0.7614 9.5070 2.3531 13.6872 5.5631 0.6034 5.4719 17.4344 38.1432 11.3406 21.9461 18.3168 5.0369 1.3136 28.3338 28.9329 1.3880 5.7199 1.3631 6.2835 13.2918 50.3042 9.4927 86.4906 7.9661 0.8481 51.7956 8.9149 385.1027 53.4966 72.8920 33.9638 122.0582 3.2603 49.6962 3.1105 231.4177 98.2105 3.7197 17.1533 104.6123 13.6060 24.4516 189.0654 51.6222 394.0158 169.3649 187.8339 1.7290 35.7749 8.1426 17.6612 15.5018 17.9852 19.3425 15.4170 14.2178 11.8545 15.3147 10.5529 118.9465
temp: 298.150 k
press: 1.00000 atm
elementType: 8 7 7 7 7 6 6 6 6 6 6 6 6 6 6 6 6 6 1 1 1 1 1 1 1 1 1 1 1 1
symmnumber: 1
zpe: 600318.9 jmol-1
zpe.correction: 0.228649 hartree
zpe.thermalcorrener: 0.244434 hartree
zpe.thermalcorrenthalpy: 0.245378 hartree
zpe.thermalcorrgfe: 0.184177 hartree
zpe.sumelectzpe: -795.522394 hartree
zpe.sumelectthermal: -795.506609 hartree
zpe.sumelectthermalent: -795.505665 hartree
zpe.sumelectthermalfe: -795.566866 hartree
dipole: 10.6151 -3.1064 -0.6276
dipole: 11.0781
quadrupole: -133.1220 -84.1545 -107.0551
quadrupole: -4.0077 1.1574 -0.0157
quadrupole: -25.0114 23.9561 1.0554 -4.0077 1.1574 -0.0157
hfenergy: -795.7510429 hartree
pointgroup: C01 [X(C13H12N4O1)]
dipole: -4.1715089 -1.2375548 0.2512308 debye
polarizability: 298.841308|-3.5959477|192.1721173|1.914844|3.1673533|77.983828 unknown
InChI: InChI=1S/C13H12N4O/c1-8-3-5-10(6-4-8)17-12-11(7-14-17)13(18)16-9(2)15-12/h3-7,14H,1-2H3
charge 0 multiplicity 1
30 atoms
O  4.566862 -1.198673 0.029435
N  -0.130272 -0.810113 0.111107
N  0.251094 -2.164495 0.153316
N  1.155753 1.281487 -0.009816
N  3.614356 0.966086 -0.067812
C  1.056446 -0.054099 0.058652
C  2.161638 -0.985766 0.077513
C  -1.50268 -0.419511 0.051381
C  1.624644 -2.268539 0.158188
C  -1.849521 0.929754 0.319856
C  -2.511699 -1.362797 -0.265649
C  3.540554 -0.453539 0.013206
C  -4.239101 0.379162 -0.000692
C  -3.203976 1.308352 0.287887
C  -3.863816 -0.95846 -0.278658
C  2.498436 1.716891 -0.077805
C  -5.692543 0.81463 -0.030141
C  2.654697 3.215591 -0.164317
H  -0.442659 -2.865747 0.405767
H  2.118341 -3.235594 0.218084
H  -1.054253 1.651924 0.522344
H  -2.26976 -2.394173 -0.547974
H  -3.462886 2.353363 0.4959
H  -4.636201 -1.695801 -0.525469
H  -6.371792 -0.044541 -0.162913
H  -5.976951 1.330247 0.905593
H  -5.880969 1.522337 -0.859605
H  2.201647 3.698005 0.721381
H  2.11861 3.603756 -1.049488
H  3.720202 3.477762 -0.226168
