program: Gaussian 09
title: 000219742
version: EM64L-G09RevD.01
frameworkgroup: C1[X(C12H9ClN4O)]
method: RPBEPBE
basis: SDD
operation: Freq
keyword: #p
keyword: freq=noraman
keyword: PBEPBE/SDD
title: #p freq=noraman PBEPBE/SDD
converged: YES YES NO NO
title: Mulliken charges:
elementType: Cl O N N N N C C C C C C C C C C C C H H H H H H H H H
charge: -0.041838 -0.239962 -0.278575 -0.433925 -0.008799 -0.026282 0.267933 0.497734 0.152707 -0.363069 -0.369446 -0.391449 -0.191519 -0.203191 -0.119179 0.256328 -0.775999 -0.211766 0.327545 0.275096 0.310457 0.285144 0.262204 0.263624 0.267091 0.264602 0.224533
chargesum: 0.00000
title: Mulliken charges with hydrogens summed into heavy atoms:
elementType: Cl O N N N N C C C C C C C C C C C C
charge: -0.041838 -0.239962 -0.278575 -0.106379 -0.008799 -0.026282 0.267933 0.497734 0.152707 -0.087973 -0.058989 -0.106305 0.070684 0.060433 -0.119179 0.256328 -0.019772 -0.211766
polarizability: 2.67392404e+02 -9.51420174e+00 1.60317422e+02 -2.11757889e+00 5.68258893e+00 9.13338855e+01
1716.lowfreq: -7.5524 -3.8581 0.0018 0.0022 0.0023 4.0701 26.3862 39.5551 42.4026
frequency: 26.1073 39.5506 42.3967 57.0154 74.7667 78.4583 111.2289 127.1690 150.9712 192.5720 240.2455 249.8987 288.6908 310.2852 359.8713 379.9564 414.5416 445.9749 463.5388 497.6891 508.9937 545.4528 549.7083 579.6396 590.4340 618.6015 652.1222 661.4337 683.1649 709.9129 739.3743 804.6474 824.9621 843.5689 853.8750 922.6592 950.1119 958.4758 981.1095 990.9430 1000.3563 1038.8247 1049.1793 1073.4430 1109.5720 1124.6589 1186.5701 1197.2827 1221.6229 1271.2803 1297.5467 1338.0926 1377.5687 1380.6639 1387.3767 1403.8281 1432.1333 1447.8057 1454.9651 1467.1578 1485.4307 1549.7832 1590.8284 1601.0310 1640.2928 2189.2139 2997.3198 3087.6875 3123.7619 3151.3229 3166.7471 3175.8371 3185.5176 3236.1091 3513.1283
redmass: 1.1185 8.3715 3.6481 6.1949 5.4134 6.1738 7.6748 8.0863 7.2699 7.0589 10.2521 9.1257 6.8378 4.3374 4.0208 5.6843 3.0475 5.7709 7.7260 6.9181 4.0431 1.3509 4.7387 3.7662 4.7268 7.1404 7.9483 7.1872 4.8327 4.1069 7.4381 5.8930 1.3497 1.3711 1.3973 5.0877 2.0231 2.3247 1.3352 1.9133 3.7840 1.6801 4.6558 2.6653 2.0979 2.2143 1.1399 1.5503 3.0413 4.1539 1.2903 7.6930 6.9554 5.4273 1.2401 3.1667 1.6226 3.1551 1.2884 1.0827 2.8660 8.6079 8.1570 6.1396 6.8252 12.5979 1.0375 1.0985 1.0992 1.0921 1.0892 1.0958 1.0978 1.0989 1.0768
irintensity: 0.1798 1.2339 1.1474 6.3050 9.0308 2.3593 3.9400 4.6136 1.0444 3.3366 1.1140 1.6531 0.3855 1.1274 0.4359 5.0921 0.1362 3.8669 21.9889 5.6792 21.1979 72.4950 12.7768 14.7485 7.7193 2.2226 6.1726 0.8184 2.4052 0.8721 6.0356 7.2832 25.9110 55.3397 22.4706 1.7705 23.2571 27.4915 4.4697 20.3707 21.8231 13.2864 9.4251 43.6492 3.0415 10.6073 5.1433 5.1997 80.9807 42.6956 0.4105 3.7175 7.1486 65.6221 52.7519 4.4448 165.6784 30.3313 22.1123 19.2663 216.2949 73.6448 5.6214 1.1234 133.3164 84.0124 4.7754 10.8544 6.5505 19.5933 1.7034 4.4405 0.9350 0.2801 25.7211
temp: 298.150 k
press: 1.00000 atm
elementType: 17 8 7 7 7 7 6 6 6 6 6 6 6 6 6 6 6 6 1 1 1 1 1 1 1 1 1
symmnumber: 1
zpe: 499285.7 jmol-1
zpe.correction: 0.190168 hartree
zpe.thermalcorrener: 0.206638 hartree
zpe.thermalcorrenthalpy: 0.207582 hartree
zpe.thermalcorrgfe: 0.143417 hartree
zpe.sumelectzpe: -1215.689048 hartree
zpe.sumelectthermal: -1215.672578 hartree
zpe.sumelectthermalent: -1215.671634 hartree
zpe.sumelectthermalfe: -1215.735799 hartree
dipole: -1.7948 0.9993 -3.6618
dipole: 4.1986
quadrupole: -139.8945 -98.5468 -112.1546
quadrupole: 3.7567 -3.2270 -3.9775
quadrupole: -23.0292 18.3185 4.7107 3.7567 -3.2270 -3.9775
hfenergy: -1215.8792156 hartree
pointgroup: C01 [X(C12H9Cl1N4O1)]
dipole: 0.7072914 -0.9370332 -1.1620597 debye
polarizability: 264.8273265|-14.77627|149.0414338|12.3045345|-28.7117793|105.1749516 unknown
InChI: InChI=1S/C12H9ClN4O/c1-8(18)16-12-9(6-14)7-15-17(12)11-4-2-10(13)3-5-11/h2-5,7,16H,1H3
charge 0 multiplicity 1
27 atoms
Cl 5.7104 -0.882907 0.327353
O  -1.182956 -1.514025 1.974065
N  -0.02751 0.946621 -0.247487
N  -1.318193 -1.19015 -0.333048
N  -0.253151 2.322064 -0.399922
N  -4.791679 0.616208 -0.803441
C  -1.212259 0.219204 -0.323054
C  1.328365 0.490415 -0.096339
C  -2.246095 1.16492 -0.525422
C  2.329764 1.094501 -0.893242
C  1.655399 -0.503012 0.853815
C  -1.595484 2.439994 -0.566355
C  3.669871 0.678258 -0.763312
C  2.996002 -0.927872 0.977653
C  3.981572 -0.336296 0.164496
C  -1.407791 -1.985874 0.826695
C  -1.808195 -3.431566 0.573341
C  -3.628981 0.868338 -0.671422
H  -1.549536 -1.629924 -1.227912
H  2.057505 1.886649 -1.595549
H  0.886202 -0.906587 1.518998
H  -2.045034 3.421558 -0.700129
H  4.454999 1.13349 -1.372957
H  3.266778 -1.690662 1.712775
H  -2.896273 -3.537738 0.737187
H  -1.296952 -4.080121 1.301186
H  -1.575568 -3.776288 -0.449075
