program: Gaussian 09
title: 000219739
version: EM64L-G09RevD.01
frameworkgroup: C1[X(C4H3N3O4)]
method: RPBEPBE
basis: SDD
operation: Freq
keyword: #pfreq=noraman
keyword: PBEPBE/SDD
title: #p freq=noraman PBEPBE/SDD
converged: YES YES NO NO
title: Mulliken charges:
elementType: O O O O N N N C C C C H H H
charge: -0.460634 -0.167993 -0.200866 -0.168103 -0.385255 0.009305 0.045251 0.237025 0.168387 -0.332797 0.164959 0.382878 0.305222 0.402620
chargesum: 0.00000
title: Mulliken charges with hydrogens summed into heavy atoms:
elementType: O O O O N N N C C C C
charge: -0.058014 -0.167993 -0.200866 -0.168103 -0.002377 0.009305 0.045251 0.237025 0.168387 -0.027575 0.164959
polarizability: 1.05061079e+02 -5.26269185e+00 9.68376085e+01 3.41308181e+00 -8.34028614e-01 3.37518044e+01
1716.lowfreq: -4.7434 -2.3986 -0.0003 0.0000 0.0004 6.1677 41.7740 54.1516 150.9377
frequency: 41.7632 54.1468 150.9376 178.2363 205.7128 235.7312 368.2753 370.7717 475.1886 546.1862 569.9589 606.4062 633.8680 660.7794 699.0528 740.6995 750.2010 763.5609 874.7177 910.3221 970.2890 1068.4970 1109.2611 1178.0538 1204.2494 1245.7242 1296.9771 1328.8247 1370.3881 1399.2376 1425.1100 1545.7875 1685.2005 3259.8687 3550.8097 3586.7640
redmass: 15.2119 11.2923 11.8998 4.7964 9.7752 7.7138 8.8252 11.4774 9.0110 1.5766 6.3218 3.3054 4.8139 5.2271 7.6820 1.8406 12.8033 2.1993 1.3831 5.3665 5.5404 3.1842 3.5410 1.8705 2.9713 3.5720 3.5193 5.5616 11.8059 2.2390 5.6400 5.7836 9.8739 1.0995 1.0649 1.0831
irintensity: 0.1213 0.1829 0.1802 0.5335 0.9485 1.5587 6.6337 0.0340 5.3860 102.4004 19.1373 40.6166 29.9529 24.5095 12.8196 76.8293 29.5179 53.1476 30.7386 28.2867 309.7235 16.1912 58.1591 9.0782 123.3092 54.8840 80.8198 17.5128 165.0775 46.2888 39.2537 2.9054 254.5006 5.8278 71.7368 146.8992
temp: 298.150 k
press: 1.00000 atm
elementType: 8 8 8 8 7 7 7 6 6 6 6 1 1 1
symmnumber: 1
zpe: 221677.3 jmol-1
zpe.correction: 0.084432 hartree
zpe.thermalcorrener: 0.093658 hartree
zpe.thermalcorrenthalpy: 0.094603 hartree
zpe.thermalcorrgfe: 0.048568 hartree
zpe.sumelectzpe: -618.466632 hartree
zpe.sumelectthermal: -618.457406 hartree
zpe.sumelectthermalent: -618.456461 hartree
zpe.sumelectthermalfe: -618.502496 hartree
dipole: 4.8221 3.0103 0.1035
dipole: 5.6855
quadrupole: -54.6397 -72.3944 -61.4251
quadrupole: -4.7124 -1.0513 -0.1001
quadrupole: 8.1800 -9.5747 1.3946 -4.7124 -1.0513 -0.1001
hfenergy: -618.551064 hartree
pointgroup: C01 [X(C4H3N3O4)]
dipole: 1.8731687 -1.2203947 -0.0734202 debye
dipolederiv: -1.3108036 0.1978886 0.1429594 0.305035 -0.3760216 -0.0335022 0.1557283 -0.0010278 -0.4692087 -0.591021 -0.1543684 0.0283253 -0.0297262 -0.8993235 -0.1311413 0.050932 -0.1130368 -0.309133 -0.7919499 -0.0268215 0.1624468 0.0514901 -0.4302089 0.0645575 0.103275 0.0786715 -0.2872031 -0.4393506 0.0320454 0.0757886 -0.012511 -0.6404784 0.1603822 0.0991214 0.1395511 -0.2639417 -0.3957367 0.2569586 -0.0015512 0.4752632 -0.0994985 0.0022972 0.0447245 0.0074134 -0.1645662 -0.3019742 -0.1182621 -0.0161701 0.0454639 -0.2643767 -0.0048591 -0.0325985 0.0054898 -0.1868291 1.3204405 -0.2043429 -0.2706721 -0.3526907 1.1769185 -0.2684734 -0.2252669 -0.2238323 0.3522355 -0.0700364 -0.5618969 0.0128681 -0.6814368 -0.247613 -0.0174615 -0.0684713 0.038279 0.0580012 -0.2195043 0.3769249 0.0372492 0.3252605 -0.205426 0.039783 0.0186728 -0.0191684 0.0344273 0.1442397 0.1231428 -0.0050535 -0.1640559 0.0686426 -0.0005538 0.0501805 -0.0327023 -0.0521051 1.8642961 0.1825523 -0.1630709 0.1759976 1.3428431 0.2249828 -0.1686638 0.1551934 0.36108 0.3212951 -0.0671474 0.0020309 -0.0402945 0.2838068 0.0038134 -0.0036368 -0.0097712 0.3324097 0.0904626 -0.0018296 0.0009662 -0.0102941 0.124628 -0.0058819 0.0021628 0.0168786 0.18461 0.3796428 -0.0348438 -0.0061168 -0.0875012 0.1661077 -0.033943 -0.0261599 -0.041938 0.4102232 unknown
polarizability: 105.0297267|5.0172442|96.61182|-5.3284587|-1.7018163|34.0089454 unknown
InChI: InChI=1S/C4H3N3O4/c8-4(9)3-2(7(10)11)1-5-6-3/h1,6,8H
charge 0 multiplicity 1
14 atoms
O  2.926958 0.168282 -0.217702
O  1.544067 1.998971 0.236966
O  -2.931298 0.584731 0.344716
O  -1.303701 1.982006 -0.458006
N  0.982151 -1.60051 -0.039188
N  -0.091136 -2.468232 -0.007295
N  -1.718847 0.8396 -0.034289
C  0.630585 -0.263194 -0.036928
C  -0.786693 -0.275062 0.00121
C  -1.180923 -1.644271 0.023182
C  1.672023 0.78414 0.009362
H  1.938272 -1.958402 -0.059824
H  -2.189246 -2.048293 0.04923
H  3.64739 0.850534 -0.165834
