program: Gaussian 09
title: 000006831
version: EM64L-G09RevD.01
frameworkgroup: C1[X(C10H14N4O11P2)]
method: RPBEPBE
basis: SDD
operation: Freq
keyword: #p
keyword: freq=noraman
keyword: PBEPBE/SDD
title: #p freq=noraman PBEPBE/SDD
converged: YES YES NO NO
title: Mulliken charges:
elementType: P P O O O O O O O O O O O N N N N C C C C C C C C C C H H H H H H H H H H H H H H
charge: 1.456339 1.454359 -0.407088 -0.448248 -0.448780 -0.544710 -0.757172 -0.676419 -0.543438 -0.192749 -0.647283 -0.676484 -0.622549 -0.197291 -0.022454 -0.371425 -0.000100 -0.127495 -0.262331 -0.017683 0.055592 -0.322286 0.332233 -0.248911 -0.123076 0.035385 -0.234170 0.265657 0.266428 0.264661 0.276566 0.272190 0.256046 0.380665 0.380538 0.341589 0.332172 0.241584 0.415600 0.418280 0.446257
chargesum: 0.00000
title: Mulliken charges with hydrogens summed into heavy atoms:
elementType: P P O O O O O O O O O O O N N N N C C C C C C C C C C
charge: 1.456339 1.454359 -0.407088 -0.067582 -0.068242 -0.544710 -0.757172 -0.260818 -0.543438 -0.192749 -0.229003 -0.230227 -0.622549 -0.197291 -0.022454 -0.039253 -0.000100 0.138162 0.004097 0.246978 0.332157 0.205950 0.332233 0.092678 -0.123076 0.035385 0.007413
polarizability: 2.80679884e+02 2.16910267e+01 2.14226063e+02 2.49313522e+00 -1.77281739e+01 1.65875041e+02
1716.lowfreq: -5.9913 -0.0011 -0.0007 -0.0001 5.3287 6.3703 13.1201 24.7815 34.6025
frequency: 12.1250 24.5940 34.5741 51.5867 59.6081 66.2883 71.6759 82.2592 92.6793 95.5895 103.4013 109.0063 140.3321 147.9550 153.6264 162.9228 192.4788 204.7770 218.5394 233.4006 240.2143 243.0026 260.1831 265.5029 275.2903 299.4758 307.0306 317.8681 328.3514 339.1610 348.2163 358.8931 367.6661 379.5692 403.3929 429.6837 482.9306 486.2037 498.6532 531.7686 540.0946 541.1912 553.4368 568.7735 592.2351 635.4164 655.4601 660.4591 663.6664 681.2561 705.3228 717.9606 727.7245 765.1587 775.8935 794.0875 802.7907 818.0009 835.1772 855.9532 865.4908 882.0552 887.8322 927.7409 942.8558 958.6534 965.9681 997.9338 1005.3277 1020.8165 1021.7256 1027.4429 1040.7914 1063.3025 1082.6659 1093.9646 1101.0254 1131.5429 1141.1678 1169.0291 1205.0190 1216.7087 1225.0577 1261.6697 1266.9913 1269.6872 1274.9966 1301.2613 1319.4645 1326.3213 1327.1764 1339.2595 1343.3261 1360.8646 1377.8203 1394.3956 1401.3914 1417.5922 1465.5536 1514.6447 1525.6866 1595.6379 1639.2534 2968.0537 3000.0224 3005.4397 3011.2150 3031.7344 3044.4659 3080.9473 3123.3722 3195.0364 3449.8490 3528.0016 3588.5470 3600.7719 3603.5110
redmass: 9.9435 7.8386 6.9707 7.3948 7.0624 9.6790 3.9714 10.0975 2.2090 5.5706 7.0623 7.9810 5.2172 3.3788 4.1142 5.2511 6.7262 5.1082 4.6463 2.4125 5.4192 4.6909 1.9177 3.7703 4.5629 4.3421 6.5629 4.8545 6.3598 5.2427 9.2936 6.2448 5.4228 7.9901 6.3442 8.8040 7.8668 3.7056 3.7015 2.4827 1.7922 1.9644 2.1674 6.1183 7.2516 4.9878 9.9363 9.0347 8.0629 5.3313 7.9919 6.6267 12.0058 10.3887 8.6065 4.7600 3.5960 2.1265 1.8267 3.3949 2.0049 3.1333 1.4655 7.6352 4.4892 5.3839 1.8377 3.5185 1.3264 3.8926 2.8368 3.6227 2.6588 4.3557 4.6836 10.3632 3.2296 2.0114 3.4087 1.2040 1.2768 1.9473 1.2033 1.2065 1.3906 1.2604 1.9889 1.2173 1.2925 2.2012 1.4614 1.6355 2.1757 1.5334 1.3821 1.4375 1.5897 3.6437 1.0716 4.4085 6.6026 6.5852 12.4036 1.0711 1.0598 1.0862 1.0869 1.0870 1.0861 1.1073 1.0928 1.1030 1.0647 1.0797 1.0665 1.0673 1.0666
irintensity: 0.5931 5.4063 6.5994 3.4005 6.2894 10.5082 8.3039 2.7697 90.5451 4.1900 7.7249 5.7080 11.5587 27.8306 21.9228 7.5797 0.8916 6.2299 11.2576 18.2496 39.2474 10.8693 44.1719 12.6727 14.5792 13.4826 28.3093 6.2044 21.7559 9.3287 154.6922 24.9238 15.7033 23.7919 47.6136 9.0909 5.9881 13.5837 4.2481 172.9875 16.6631 32.4194 102.6807 8.4485 3.5185 3.5081 29.1034 38.9143 72.1598 21.2404 125.9153 118.7964 77.7274 417.4606 14.7157 11.4980 166.6057 137.6845 49.3932 72.4285 42.9957 38.5100 9.1672 102.3279 247.2380 69.8845 139.0692 109.5194 101.2311 47.9248 41.4638 56.1128 22.2462 34.1636 82.1484 112.9066 208.1808 18.8509 10.1295 38.1617 6.4613 82.2194 21.9234 125.6554 6.5001 18.6236 19.9117 3.4088 5.8025 35.6897 30.7055 23.3022 65.9736 8.4549 10.3772 4.1818 5.6616 8.4673 16.6003 30.8177 365.5668 87.3471 380.9197 1155.9302 52.1246 12.3425 20.2220 13.8257 17.1166 2.8893 18.9064 96.1709 61.1150 36.2240 112.3329 40.9504 105.9575
temp: 298.150 k
press: 1.00000 atm
elementType: 15 15 8 8 8 8 8 8 8 8 8 8 8 7 7 7 7 6 6 6 6 6 6 6 6 6 6 1 1 1 1 1 1 1 1 1 1 1 1 1 1
symmnumber: 1
zpe: 719186.6 jmol-1
zpe.correction: 0.273924 hartree
zpe.thermalcorrener: 0.301734 hartree
zpe.thermalcorrenthalpy: 0.302678 hartree
zpe.thermalcorrgfe: 0.213945 hartree
zpe.sumelectzpe: -2116.286542 hartree
zpe.sumelectthermal: -2116.258732 hartree
zpe.sumelectthermalent: -2116.257788 hartree
zpe.sumelectthermalfe: -2116.346521 hartree
dipole: 5.6250 11.4290 -0.2183
dipole: 12.7401
quadrupole: -226.4308 -167.3188 -168.9978
quadrupole: -41.5226 35.3528 23.8692
quadrupole: -38.8483 20.2637 18.5846 -41.5226 35.3528 23.8692
hfenergy: -2116.560466 hartree
pointgroup: C01 [X(C10H14N4O11P2)]
dipole: 1.7983039 4.6642606 -0.3664756 debye
polarizability: 276.3896287|26.9604015|216.6310758|0.3355926|-20.6497864|167.7602841 unknown
InChI: InChI=1S/C10H14N4O11P2/c15-6-4(1-23-27(21,22)25-26(18,19)20)24-10(7(6)16)14-3-13-5-8(14)11-2-12-9(5)17/h2-4,6-7,10-11,15-16,18-19,21H,1H2
charge 0 multiplicity 1
41 atoms
P  4.875272 0.114597 -0.423278
P  2.595353 -2.007176 0.10445
O  0.574076 0.748827 -0.546858
O  -1.345593 3.39627 -0.802903
O  0.627344 4.105275 0.854349
O  3.479208 1.09005 -0.647285
O  4.238311 -1.485029 -0.240784
O  5.280073 0.59118 1.179382
O  5.976928 0.218401 -1.540534
O  -5.029461 -3.0038 1.330523
O  2.800134 -3.669565 -0.086446
O  1.715395 -1.523475 -1.253934
O  2.055147 -1.543562 1.519691
N  -1.579329 -0.093266 0.053635
N  -2.140362 -1.821853 1.444194
N  -3.798243 0.142557 -1.107585
N  -5.483694 -1.430991 -0.372726
C  -1.047164 2.388636 0.204452
C  0.349117 2.668005 0.839858
C  -0.875251 1.03588 -0.545234
C  1.321417 1.978706 -0.140585
C  2.65303 1.597618 0.480536
C  -2.907113 -0.422763 -0.210016
C  -1.161356 -0.983937 1.090392
C  -3.252288 -1.485548 0.645911
C  -4.605735 -2.06609 0.612861
C  -5.08505 -0.436506 -1.127117
H  -1.853675 2.334462 0.959562
H  0.417691 2.217999 1.84851
H  -1.219985 1.175173 -1.588286
H  1.476604 2.615314 -1.031415
H  2.534803 0.82561 1.264353
H  3.133122 2.499425 0.900281
H  -0.874579 4.234196 -0.533131
H  0.504644 4.480266 1.760906
H  -0.137668 -1.003809 1.465026
H  -3.574328 0.939812 -1.707349
H  -5.775436 0.016761 -1.849616
H  6.078308 0.161669 1.578488
H  3.190605 -3.967585 -0.947609
H  1.24533 -0.619928 -1.136669
