program: Gaussian 09
title: 000219691
version: EM64L-G09RevD.01
frameworkgroup: C1[X(C12H10N2O2)]
method: RPBEPBE
basis: SDD
operation: Freq
keyword: #p
keyword: freq=noraman
keyword: PBEPBE/SDD
title: #p freq=noraman PBEPBE/SDD
converged: YES YES NO NO
title: Mulliken charges:
elementType: O O N N C C C C C C C C C C C C H H H H H H H H H H
charge: -0.292933 -0.255581 -0.003061 -0.033727 0.550964 0.222166 0.199230 -0.451527 -0.431164 -0.342948 -0.365557 -0.536780 -0.491204 0.272732 -0.250465 -0.251230 0.264207 0.240603 0.263350 0.254269 0.240190 0.244557 0.240428 0.241330 0.239699 0.232455
chargesum: 0.00000
title: Mulliken charges with hydrogens summed into heavy atoms:
elementType: O O N N C C C C C C C C C C C C
charge: -0.292933 -0.255581 -0.003061 -0.033727 0.550964 0.222166 0.199230 -0.187320 -0.190560 -0.079598 -0.111288 0.188394 0.222280 0.272732 -0.250465 -0.251230
polarizability: 3.13954615e+02 8.61093826e+00 1.64199842e+02 4.88844714e-02 2.78860103e-02 6.72355738e+01
1716.lowfreq: -15.8447 -5.6352 -5.0355 -0.0008 -0.0004 0.0004 5.1117 35.7759 60.8654
frequency: -15.7295 35.7731 60.8632 81.1981 100.7955 133.3435 147.3823 161.9855 189.9607 191.1524 207.8950 257.3958 277.7918 290.3819 316.6592 375.6500 387.6491 436.3587 447.1721 470.7358 493.9824 548.6814 587.9211 597.2293 613.7761 648.7375 704.5416 729.5545 751.3237 798.8747 819.0676 866.8627 933.9849 936.5879 963.4003 964.3697 997.2606 1106.8345 1108.6090 1120.2706 1150.3510 1157.1933 1159.6295 1172.4845 1243.9708 1276.1686 1292.8484 1354.8108 1396.0183 1424.5146 1439.7711 1452.3152 1457.7804 1461.3087 1467.9951 1470.5841 1494.3087 1557.8809 1576.3066 1610.2540 2152.8706 2169.2643 2975.1525 3009.8910 3069.6240 3117.1173 3123.3366 3134.3404 3135.9156 3140.0767 3175.8193 3204.0945
redmass: 3.0165 6.9621 7.0947 6.8835 3.3519 12.1310 2.9565 6.9637 1.2998 2.2110 3.7460 2.0219 5.5272 2.8713 4.2323 4.8819 4.9609 9.7789 4.0825 5.1679 5.8288 5.4507 6.4176 12.1327 4.6416 5.6926 6.3174 3.1730 5.7304 6.9474 1.4192 1.5642 6.2587 1.3710 8.4678 1.4653 3.8082 1.2439 1.2578 2.0088 1.8549 1.5419 1.9716 2.0553 2.1395 2.9491 1.6498 2.4624 2.8466 1.7279 1.2583 1.6589 1.0522 1.1699 1.0481 1.0942 2.5731 6.9870 5.6550 5.9827 12.6161 12.6326 1.0322 1.0281 1.1048 1.0893 1.1054 1.1010 1.1060 1.0897 1.0953 1.0896
irintensity: 3.2970 3.6582 7.7401 3.6842 6.5081 5.2842 1.0856 0.1418 0.0092 1.1926 1.8311 1.7958 5.8520 0.8744 5.3329 5.3323 1.0593 9.3898 1.9745 0.6601 5.3160 0.7698 25.1613 0.0953 7.4289 5.8433 4.8126 2.5400 2.6805 6.6701 31.4104 22.1378 4.9979 18.8947 59.7229 9.2895 36.8260 0.0829 0.0033 75.3071 1.1848 73.0922 14.0988 40.0321 0.9547 398.0613 167.7184 7.8655 215.1934 14.6881 4.5476 29.4380 14.9089 25.1914 15.1494 85.3207 250.0499 74.2169 294.5359 112.8926 25.6078 113.1665 27.2495 73.7558 30.1468 3.9600 27.7105 20.6218 24.3176 5.1370 5.2403 6.1030
temp: 298.150 k
press: 1.00000 atm
elementType: 8 8 7 7 6 6 6 6 6 6 6 6 6 6 6 6 1 1 1 1 1 1 1 1 1 1
symmnumber: 1
zpe: 501749.8 jmol-1
zpe.correction: 0.191106 hartree
zpe.thermalcorrener: 0.205997 hartree
zpe.thermalcorrenthalpy: 0.206941 hartree
zpe.thermalcorrgfe: 0.148648 hartree
zpe.sumelectzpe: -722.015264 hartree
zpe.sumelectthermal: -722.000373 hartree
zpe.sumelectthermalent: -721.999429 hartree
zpe.sumelectthermalfe: -722.057722 hartree
dipole: -7.5111 -0.3990 0.0354
dipole: 7.5218
quadrupole: -116.1826 -88.2157 -94.6354
quadrupole: -8.8193 -0.2295 -0.0341
quadrupole: -16.5047 11.4622 5.0425 -8.8193 -0.2295 -0.0341
hfenergy: -722.2063701 hartree
pointgroup: C01 [X(C12H10N2O2)]
dipole: -2.9073222 -0.5479768 0.0686259 debye
dipolederiv: -0.6355775 0.3723567 -0.0505245 0.7003558 -1.1731187 0.1230477 -0.0945442 0.1200401 -0.278332 -2.4582075 -0.2159141 0.0212674 -0.2605508 -0.3006457 0.0013157 0.0041559 -0.0040995 -0.2869301 -0.6522591 -0.0455001 0.0033401 0.0815321 -0.1928073 -0.005178 -0.0133325 -0.0059992 -0.2364875 -0.1557093 0.0688869 -0.0083745 -0.2859787 -0.4517553 0.0256071 0.0369374 0.0273961 -0.2432978 -1.1999684 -0.3336006 0.0359381 -0.0876735 -0.015702 0.0023583 0.0034459 0.0008811 0.0070776 0.0015792 -0.7782242 0.1013729 -1.335165 0.551106 -0.0736818 0.16654 -0.0714769 0.0628662 2.099718 0.3307437 -0.0319027 0.7080158 0.0714235 0.0050704 -0.0640761 0.0076219 0.110188 0.2737153 0.3145164 -0.0382457 -0.2758204 -0.1749829 0.0018665 0.037801 0.006188 -0.1502395 0.508091 0.1428873 -0.0145142 0.3824572 0.1458361 -0.0374994 -0.0450107 -0.0391476 -0.1576674 -0.6868221 -0.1122013 0.0126929 0.4695253 0.1413406 -0.0359534 -0.0570575 -0.0377831 -0.1569166 1.5878877 0.5732969 -0.0635231 0.7475911 0.323684 -0.043853 -0.0851859 -0.0451952 -0.0495876 0.130625 0.146244 -0.01992 -0.2125255 0.6933481 -0.0532079 0.0270325 -0.0502382 0.2997039 1.0885457 0.0004751 -0.0012396 -0.4533702 0.2378359 0.0069645 0.055628 0.0083662 0.2909831 -0.6446931 -0.2068921 0.022165 -0.9461076 -0.2315364 0.0355427 0.1161222 0.0399576 0.0863832 0.8260683 0.0541954 -0.0020442 -0.0973043 -0.1382741 0.0220371 0.0178417 0.023014 0.0358158 -0.2342858 -0.1696958 0.0199031 0.3887978 0.466327 -0.0497226 -0.0514885 -0.0528896 0.0675402 0.1330208 -0.0208818 0.0027234 0.0166512 0.0071912 0.018167 -0.0016668 0.0178112 0.1456183 0.0183062 0.1127811 -0.0152598 0.0605527 -0.0012516 0.0209232 -0.0093828 0.0211376 0.155493 0.0547462 -0.0653516 0.0077222 -0.0615772 -0.0123877 0.0231207 0.0075905 0.0232244 0.1662088 0.0587973 0.0221457 -0.0033705 0.1004841 -0.0149986 0.0199608 -0.0134579 0.019602 0.1332753 0.0536638 -0.1288471 -0.0898364 0.0260454 0.0052907 0.0108445 -0.0836084 -0.0281095 -0.0651368 -0.0436281 0.1347703 -0.0184054 0.0891678 -0.0100226 0.0178701 -0.0125102 0.0182342 0.1226522 0.0511465 -0.102152 0.1213333 0.046204 0.0049173 -0.0276145 0.0760202 0.0085287 -0.0620207 -0.0075796 -0.0023818 0.0394022 0.1589632 0.0502801 0.0775142 -0.0398745 0.0798721 -0.0775166 -0.0123972 -0.0137779 -0.0403547 0.1644403 0.0088901 -0.0986495 0.0055229 -0.1002228 -0.0387611 -0.1547834 -0.0778793 0.0096549 -0.1247105 0.0100121 0.0131498 0.016558 0.0132863 0.1190882 unknown
polarizability: 308.9576887|28.1621755|167.5838779|-2.2611068|-12.6935364|68.8484647 unknown
InChI: InChI=1S/C12H10N2O2/c1-15-11-4-3-9(6-12(11)16-2)5-10(7-13)8-14/h3-6H,1-2H3
charge 0 multiplicity 1
26 atoms
O  -2.737864 1.169199 -0.249789
O  -3.751168 -1.558622 0.093543
N  5.346915 -0.036927 -0.039523
N  1.932334 2.815535 -0.426357
C  0.437367 -0.855809 0.03244
C  -1.842214 0.099633 -0.104781
C  -2.410634 -1.213661 0.06096
C  -0.446267 0.257651 -0.115733
C  -0.142501 -2.15136 0.194479
C  -1.53149 -2.318316 0.208084
C  1.884883 -0.769148 0.030257
C  -2.169718 2.515976 -0.417859
C  -4.856594 -0.581014 -0.009981
C  2.736582 0.327305 -0.103924
C  4.161674 0.130985 -0.069114
C  2.297187 1.683581 -0.280026
H  -0.033372 1.258791 -0.240914
H  0.507985 -3.025302 0.311164
H  -1.986731 -3.304798 0.332623
H  2.400932 -1.730996 0.156859
H  -1.563895 2.806504 0.460717
H  -3.041284 3.179852 -0.50881
H  -1.551582 2.578596 -1.332827
H  -4.824811 -0.051485 -0.974858
H  -4.815117 0.148579 0.813949
H  -5.761114 -1.203152 0.065022
