program: Gaussian 09
title: 000219683
version: EM64L-G09RevD.01
frameworkgroup: C1[X(C10H14O2)]
method: RPBEPBE
basis: SDD
operation: Freq
keyword: #pfreq=noraman
keyword: PBEPBE/SDD
title: #p freq=noraman PBEPBE/SDD
converged: YES YES NO NO
title: Mulliken charges:
elementType: O O C C C C C C C C C C H H H H H H H H H H H H H H
charge: -0.271553 -0.453053 -0.401988 -0.353747 -0.296198 -0.332433 0.366879 -0.352554 -0.381198 -0.222994 -0.197209 -0.258191 0.211833 0.211544 0.212026 0.212302 0.206147 0.206334 0.189602 0.189761 0.247366 0.248621 0.222246 0.225986 0.343718 0.226754
chargesum: 0.00000
title: Mulliken charges with hydrogens summed into heavy atoms:
elementType: O O C C C C C C C C C C
charge: -0.271553 -0.109335 0.021388 0.070582 0.116282 0.046931 0.366879 -0.105188 -0.132576 -0.000748 0.028777 -0.031436
polarizability: 1.67310123e+02 -1.74641809e+00 1.10540199e+02 3.39484441e-01 7.81413229e-02 6.37229141e+01
1716.lowfreq: -0.0009 0.0004 0.0006 6.6078 9.0908 22.0761 33.8592 57.6393 61.8846
frequency: 33.8269 57.6321 61.8438 86.9112 136.9510 152.4091 175.1923 229.2729 233.5620 282.1446 335.0681 412.6856 447.0551 479.2961 504.1070 585.7505 611.1325 692.7567 758.5753 773.3936 788.8390 818.7054 831.3522 890.0032 939.4490 959.9567 961.6916 975.7671 982.0131 984.5547 1018.1570 1023.3084 1060.0568 1083.9964 1095.6932 1133.5948 1166.3927 1166.8972 1178.7695 1213.3475 1219.1263 1250.1523 1277.2689 1285.4040 1293.4905 1314.0376 1348.4005 1379.9534 1394.0563 1415.5759 1444.1421 1472.2111 1472.9648 1478.3151 1486.8141 1494.9881 1591.8142 1613.4553 2930.3350 2946.7076 2977.6686 2989.3154 2998.3394 3002.9696 3041.2959 3069.4875 3127.1021 3135.5654 3154.8874 3163.3308 3172.2193 3565.8418
redmass: 4.9532 2.0894 4.9454 3.7020 1.9467 2.4172 4.1389 6.3340 5.0215 1.0816 3.6498 2.9377 4.8188 3.9876 2.8557 6.1538 6.4232 2.0342 1.6524 1.0752 6.2535 1.1985 1.1827 1.4524 1.1874 7.4511 1.3540 6.8624 1.2968 6.0678 2.7480 2.0639 3.0713 1.5220 2.5591 1.5041 1.1722 1.0816 1.1741 1.2732 3.3173 1.2795 1.2837 1.0557 1.1594 1.3390 1.3850 2.2822 2.6993 1.4566 2.3855 1.2636 1.0953 1.3869 1.2236 1.1369 6.4276 6.2479 1.0546 1.0551 1.1065 1.0599 1.0585 1.1058 1.1038 1.1053 1.0846 1.0891 1.0925 1.0951 1.1005 1.0664
irintensity: 0.0130 10.4461 1.0635 1.1584 4.8689 2.5794 4.2309 0.0353 0.1040 163.6284 3.0210 0.0457 16.9518 3.4943 12.2843 13.4403 0.3709 35.7629 95.4161 1.6698 26.5080 0.4958 0.1367 8.1929 0.3295 74.8780 0.0974 12.6725 0.6587 1.5046 66.9977 31.7148 11.0942 14.3566 3.3193 0.0092 1.5742 10.2875 45.4585 21.0357 224.9673 0.1742 33.0595 0.1751 3.0237 0.8003 5.5123 3.0228 27.3494 7.4637 2.3268 51.6900 6.2109 47.2958 21.3183 4.6739 22.9173 80.4365 65.6741 31.8081 51.6404 0.3905 61.3244 23.3652 0.1025 98.1171 2.8679 12.7601 33.2500 24.3770 5.3277 2.5012
temp: 298.150 k
press: 1.00000 atm
elementType: 8 8 6 6 6 6 6 6 6 6 6 6 1 1 1 1 1 1 1 1 1 1 1 1 1 1
symmnumber: 1
zpe: 573186.8 jmol-1
zpe.correction: 0.218315 hartree
zpe.thermalcorrener: 0.230721 hartree
zpe.thermalcorrenthalpy: 0.231666 hartree
zpe.thermalcorrgfe: 0.178236 hartree
zpe.sumelectzpe: -538.964271 hartree
zpe.sumelectthermal: -538.951865 hartree
zpe.sumelectthermalent: -538.950920 hartree
zpe.sumelectthermalfe: -539.004349 hartree
dipole: 1.3213 -0.6128 -0.0109
dipole: 1.4565
quadrupole: -60.8515 -70.0511 -75.8389
quadrupole: -10.3525 0.0211 0.0654
quadrupole: 8.0623 -1.1373 -6.9250 -10.3525 0.0211 0.0654
hfenergy: -539.1825859 hartree
pointgroup: C01[X(C10H14O2)]
dipole: -0.5198289 -0.2388503 0.0333536 debye
dipolederiv: -2.0068025 -0.0643147 -0.0110001 -0.1265492 -0.3097827 0.0021811 -0.003458 0.0022133 -0.2816225 -0.7547393 0.3017844 -0.0442837 0.3800325 -0.3515006 -0.0329223 -0.0549485 -0.0335552 -0.589144 -0.1067669 -0.0106868 0.0002069 -0.0048988 0.085697 0.0111605 0.0001315 0.0099958 0.1554845 -0.134162 -0.0289354 0.0027236 -0.1509102 0.0520822 0.0117366 0.0208817 0.0129316 0.1417455 0.9845452 -0.0928832 0.0194602 -0.4210245 0.2864007 0.0100955 0.0653726 0.0148392 0.3978695 0.6884778 -0.2177496 0.0326873 -0.1502788 0.3729003 0.009719 0.0226437 0.0093852 0.4419937 1.5793838 0.1983856 -0.0093045 0.5244896 0.1201021 0.0042451 -0.0533014 0.0013672 0.1086 -0.2897317 -0.0004458 -0.0000642 -0.3865125 -0.1103903 -0.0202426 0.054107 -0.015384 -0.2147649 -0.4454781 -0.0721365 0.0075983 0.1552437 0.0503177 -0.0322817 -0.0249213 -0.0359449 -0.1889538 0.1511411 -0.0732309 0.0147769 0.0573497 0.1482144 -0.0405733 -0.0037578 -0.042686 -0.1358968 0.1641848 0.0283493 0.0008711 -0.0110547 0.1536297 -0.0428387 0.0063387 -0.0420058 -0.1394107 -0.0538541 0.0796791 -0.0084427 0.0262773 -0.2060724 0.000799 -0.0014182 0.0016334 -0.2050759 0.0661116 -0.0009717 -0.0138558 -0.013265 -0.0495283 -0.1061794 -0.0033897 -0.1233083 -0.0350512 0.0670848 0.0023267 0.0147649 -0.0122804 0.0117934 0.0925351 0.007627 0.1099283 -0.0958825 0.071259 -0.0127647 -0.024967 -0.0093547 -0.0548546 -0.111442 -0.003585 -0.1217729 -0.0347713 0.0710764 -0.0052341 0.0281562 -0.007992 0.0088577 0.098919 0.0062033 0.1090695 -0.0978152 -0.0302053 -0.0184812 -0.0225178 0.0956722 -0.077644 -0.0987842 -0.0076404 -0.1137455 -0.0603006 -0.0314976 -0.0131634 0.0273644 0.0926668 -0.0189773 0.0892954 -0.0181204 0.1019012 -0.1186851 -0.0175754 0.0350243 -0.01131 0.0350761 -0.1343141 -0.1203291 -0.0156149 -0.1592923 -0.0839603 -0.0177736 0.0356582 0.0017788 0.0371419 -0.0541914 0.1116857 0.0058225 0.1508137 -0.1637117 -0.0135735 0.1007038 -0.0173341 0.1195285 0.0204378 0.0225974 -0.0199453 0.0224132 0.1642723 0.0897415 -0.0588955 0.0070197 -0.0465339 -0.0524598 0.031146 0.005516 0.0312698 0.1670673 0.059522 -0.0455966 0.0050577 -0.0690647 -0.1125908 0.0371974 0.0083351 0.0375486 0.1502654 -0.0382601 0.1079323 -0.018266 0.1147047 -0.0175028 0.0264036 -0.0195228 0.0262265 0.1519849 0.0744814 -0.1176286 0.0155325 -0.1707076 0.1678584 0.0322427 0.0231414 0.0325598 0.3935934 -0.1265894 -0.0567249 0.0033473 -0.057756 0.0715178 0.0136344 0.0035028 0.0135987 0.17217 unknown
polarizability: 167.2962985|1.9089872|109.6223397|0.9623547|-6.4922498|64.6545973 unknown
InChI: InChI=1S/C10H14O2/c11-8-4-5-9-12-10-6-2-1-3-7-10/h1-3,6-7,11H,4-5,8-9H2
charge 0 multiplicity 1
26 atoms
O  0.187219 -0.758595 0.140513
O  -5.848693 0.578963 -0.075528
C  -2.218674 -0.566696 0.096592
C  -3.447927 0.360498 -0.035891
C  -0.908352 0.216671 -0.006403
C  -4.766709 -0.409747 0.070906
C  1.505633 -0.276188 0.090306
C  1.85535 1.084989 -0.097675
C  2.516697 -1.258215 0.244849
C  3.222003 1.450022 -0.128029
C  3.872135 -0.87792 0.212403
C  4.235396 0.47935 0.025866
H  -2.232349 -1.340908 -0.694563
H  -2.23841 -1.097111 1.06819
H  -3.432713 1.136655 0.75376
H  -3.430512 0.888485 -1.00916
H  -0.838512 0.981148 0.795868
H  -0.826007 0.726854 -0.98919
H  -4.823437 -1.18094 -0.728572
H  -4.829254 -0.922798 1.055749
H  1.088502 1.855689 -0.219319
H  2.216878 -2.301002 0.388688
H  3.489273 2.502937 -0.273769
H  4.648246 -1.642055 0.333289
H  -6.725074 0.121896 -0.013818
H  5.290391 0.771518 0.001237
