program: Gaussian 09
title: 000219682
version: EM64L-G09RevD.01
frameworkgroup: C1[X(C16H30O4)]
method: RPBEPBE
basis: SDD
operation: Freq
keyword: #pfreq=noraman
keyword: PBEPBE/SDD
title: #p freq=noraman PBEPBE/SDD
converged: YES YES NO NO
title: Mulliken charges:
elementType: O O O O C C C C C C C C C C C C C C C C H H H H H H H H H H H H H H H H H H H H H H H H H H H H H H
charge: -0.265504 -0.265504 -0.244864 -0.244863 -0.133794 -0.133795 -0.389390 -0.389388 -0.389387 -0.389391 -0.385573 -0.385573 0.220810 0.220810 -0.277805 -0.277804 -0.699071 -0.699075 -0.699077 -0.699069 0.224862 0.224863 0.203373 0.221691 0.221693 0.203365 0.203367 0.221693 0.221691 0.203371 0.213142 0.213146 0.213148 0.213140 0.225419 0.225420 0.225407 0.225432 0.212070 0.217220 0.226482 0.217221 0.226489 0.212061 0.212063 0.217221 0.226488 0.217220 0.226484 0.212068
chargesum: 0.00000
title: Mulliken charges with hydrogens summed into heavy atoms:
elementType: O O O O C C C C C C C C C C C C C C C C
charge: -0.265504 -0.265504 -0.244864 -0.244863 0.091068 0.091068 0.035673 0.035670 0.035673 0.035670 0.040714 0.040715 0.220810 0.220810 0.173034 0.173034 -0.043298 -0.043305 -0.043304 -0.043298
polarizability: 2.34639435e+02 -3.65818375e-03 1.74666959e+02 7.77660092e-01 4.01350981e-03 1.58048230e+02
1716.lowfreq: -9.4203 -8.7228 0.0004 0.0012 0.0016 3.5836 6.2830 10.5972 13.5049
frequency: -9.4203 4.6608 13.5048 28.0371 32.4989 47.1312 74.0572 79.4579 83.3139 85.8667 89.2559 101.2192 103.3504 117.4119 144.1177 146.6332 154.0736 183.4089 203.3563 211.1419 213.9144 219.7948 232.5634 256.4263 256.6766 282.3324 299.3897 341.5497 354.1665 390.2663 404.0440 412.3975 412.4657 493.1033 493.4070 631.6884 635.9793 703.9590 704.1707 750.3428 776.5264 776.7089 783.6800 792.5078 793.7607 850.1256 850.7290 873.3808 876.3683 917.0318 925.1811 925.1881 933.0352 947.8616 1018.0429 1018.0546 1047.5565 1047.5712 1051.0216 1059.3221 1061.1214 1065.6769 1097.7754 1099.4484 1099.5721 1101.4138 1113.2559 1116.7793 1120.1148 1131.9968 1153.6104 1154.5160 1170.4986 1239.3231 1244.5023 1244.9215 1254.2570 1256.6416 1257.3725 1272.8262 1272.8340 1278.8076 1281.2691 1323.4087 1326.1242 1326.1527 1330.6150 1331.0983 1352.7875 1358.9989 1378.6969 1383.6777 1394.1971 1394.2751 1394.4543 1394.5171 1459.6162 1459.6167 1467.6213 1467.7242 1470.3799 1470.3804 1478.1828 1478.1975 1478.8244 1478.8518 1480.1367 1483.3787 1483.3883 1483.6619 1483.7951 1490.4327 1632.2505 1633.4128 2977.0832 2977.1305 2977.8525 2977.8592 2981.7826 2981.7839 2986.5051 2986.5773 2988.3714 2993.1586 3000.6797 3004.2598 3013.5129 3013.5235 3031.9244 3035.1185 3035.1191 3045.6974 3045.7014 3047.0684 3068.6494 3074.7855 3074.8016 3076.1319 3076.3054 3076.3533 3076.3747 3077.8226 3077.8890 3080.9464
redmass: 3.4558 3.7990 3.7131 6.0439 4.4158 4.3817 2.1524 2.2980 2.1842 2.9029 4.0729 1.9487 2.2971 3.8928 1.8997 3.2250 2.0971 2.1039 3.3518 1.3861 2.6319 2.6187 1.5278 1.3096 1.3285 2.2386 3.4419 3.2560 3.9525 3.7214 3.6145 2.7298 2.7291 4.0659 4.3209 2.6419 2.5424 3.7691 3.7836 1.0675 1.2887 1.2975 2.4650 2.2466 1.1545 1.6196 1.5668 2.9214 3.6170 1.2177 2.1827 2.1813 3.0513 3.5662 1.6848 1.6846 1.4910 1.4910 3.3579 3.0660 3.1370 3.6804 2.7014 2.4873 2.4914 2.3340 2.7556 1.9714 2.4295 1.5986 2.4495 2.4657 1.1811 1.2407 1.2887 1.2810 1.2678 1.2764 1.2709 1.1568 1.1572 1.1533 1.0628 1.2818 1.4412 1.4410 1.3624 1.3725 1.4027 1.5291 1.5481 1.6875 1.2074 1.2075 1.2190 1.2192 1.0760 1.0760 1.0775 1.0763 1.0762 1.0844 1.0511 1.0511 1.0524 1.0519 1.0831 1.0463 1.0462 1.0500 1.0506 1.0925 9.0939 9.1306 1.0357 1.0357 1.0355 1.0355 1.0601 1.0601 1.0602 1.0602 1.0603 1.0592 1.0574 1.0566 1.0860 1.0859 1.1009 1.1017 1.1017 1.0993 1.0993 1.1045 1.1089 1.1010 1.1010 1.0994 1.0994 1.0998 1.0998 1.1005 1.1005 1.1072
irintensity: 0.0272 0.0000 0.7086 3.2537 0.6024 0.0000 0.0000 0.0000 0.0133 0.4909 0.0000 0.0000 0.0017 0.0000 0.6943 1.3632 0.0000 2.8093 0.0000 0.0016 11.4721 0.0000 5.6398 0.9654 0.0000 0.0000 25.1563 7.1707 0.0000 0.0000 0.5311 3.6422 0.0000 0.0000 11.2627 0.0000 0.9709 0.0000 8.2392 5.8234 0.0000 2.4666 0.0000 30.8732 0.0023 16.9190 0.0000 0.0000 13.8929 0.4268 0.0114 3.8658 100.9227 0.0000 0.0038 2.8371 0.0058 22.0885 0.0000 5.7720 0.0000 154.7999 500.7316 0.0005 5.3056 0.0000 0.0000 154.6384 0.0000 0.0001 105.0341 0.0000 3.1528 0.0000 0.7005 0.0000 2.3433 0.0000 50.7258 0.2289 0.0006 0.7398 0.0000 0.0000 0.0023 4.3760 15.8696 0.0000 78.6469 0.0000 4.3182 0.0000 0.0323 32.7637 15.7719 0.0692 1.3379 0.0584 33.1914 0.0000 0.0342 0.9036 0.0021 3.9612 0.0037 49.0504 0.0000 10.1126 0.0551 42.2697 0.0034 20.2850 282.5146 0.0003 0.0016 88.9046 30.9404 0.0265 0.0000 0.0000 128.5070 0.0001 0.0000 4.4754 0.0000 70.8339 0.5609 17.9763 0.0000 0.0995 0.0811 0.4815 17.0113 0.0403 0.0000 10.2956 0.1294 176.9813 0.0493 65.6025 0.1363 0.0381 204.5612 84.6823
temp: 298.150 k
press: 1.00000 atm
elementType: 8 8 8 8 6 6 6 6 6 6 6 6 6 6 6 6 6 6 6 6 1 1 1 1 1 1 1 1 1 1 1 1 1 1 1 1 1 1 1 1 1 1 1 1 1 1 1 1 1 1
symmnumber: 1
zpe: 1143468.2 jmol-1
zpe.correction: 0.435524 hartree
zpe.thermalcorrener: 0.460578 hartree
zpe.thermalcorrenthalpy: 0.461522 hartree
zpe.thermalcorrgfe: 0.375347 hartree
zpe.sumelectzpe: -926.981019 hartree
zpe.sumelectthermal: -926.955965 hartree
zpe.sumelectthermalent: -926.955020 hartree
zpe.sumelectthermalfe: -927.041196 hartree
dipole: 0.0000 -0.0008 0.0000
dipole: 0.0008
quadrupole: -116.2820 -120.4270 -135.2524
quadrupole: 0.0072 19.6163 -0.0040
quadrupole: 7.7051 3.5602 -11.2652 0.0072 19.6163 -0.0040
hfenergy: -927.4165425 hartree
pointgroup: C01 [X(C16H30O4)]
dipole: 0.0000016 -0.0002979 0.0000001 debye
polarizability: 234.6216571|0.0168814|174.6669639|1.4020364|0.0028124|158.0660023 unknown
InChI: InChI=1S/C16H30O4/c1-5-13(6-2)15(17)19-11-9-10-12-20-16(18)14(7-3)8-4/h13-14H,5-12H2,1-4H3
charge 0 multiplicity 1
50 atoms
O  3.098585 -0.000875 0.218018
O  -3.098442 -0.003285 -0.21781
O  4.346496 -0.000343 -1.747781
O  -4.346361 -0.001929 1.747985
C  5.51034 0.000692 0.437068
C  -5.510195 -0.003376 -0.436869
C  6.355248 1.284796 0.195417
C  6.357574 -1.281802 0.195039
C  -6.356402 1.279949 -0.195661
C  -6.356134 -1.28665 -0.194403
C  0.677077 -0.0019 0.374731
C  -0.676936 -0.00254 -0.374519
C  4.30429 -0.000234 -0.494458
C  -4.30415 -0.002807 0.494662
C  1.852003 -0.001636 -0.603626
C  -1.851862 -0.002704 0.603836
C  5.600772 2.594654 0.507267
C  5.605484 -2.593121 0.506514
C  -5.603243 2.590465 -0.507937
C  -5.602716 -2.597312 -0.505431
H  5.13353 0.000214 1.477387
H  -5.133381 -0.003857 -1.477186
H  7.261811 1.216701 0.828369
H  6.694963 1.287152 -0.858476
H  6.697257 -1.28324 -0.858867
H  7.264023 -1.212241 0.82799
H  -7.262894 1.210726 -0.828589
H  -6.696108 1.28232 0.858235
H  -6.695843 -1.288068 0.859494
H  -7.262645 -1.218224 -0.827393
H  0.751585 0.887652 1.029399
H  0.752249 -0.891142 1.029744
H  -0.751469 -0.892109 -1.029161
H  -0.752081 0.886685 -1.029558
H  1.856635 0.892875 -1.254039
H  1.857425 -0.896462 -1.253598
H  -1.856606 -0.897246 1.254209
H  -1.857175 0.892092 1.253849
H  5.243471 2.612162 1.553816
H  6.25635 3.471463 0.356635
H  4.721874 2.718559 -0.151988
H  6.262651 -3.468693 0.355615
H  4.726809 -2.718429 -0.152773
H  5.248231 -2.61159 1.553063
H  -5.245976 2.608008 -1.554498
H  -6.259695 3.466665 -0.357571
H  -4.724467 2.715454 0.151275
H  -6.259009 -3.473495 -0.354273
H  -4.72393 -2.721527 0.153913
H  -5.245413 -2.61575 -1.551964
