program: Gaussian 09
title: 000219668
version: EM64L-G09RevD.01
frameworkgroup: C1[X(C10H13Br)]
method: RPBEPBE
basis: SDD
operation: Freq
keyword: #p
keyword: freq=noraman
keyword: PBEPBE/SDD
title: #p freq=noraman PBEPBE/SDD
converged: NO YES NO NO
title: Mulliken charges:
elementType: Br C C C C C C C C C C H H H H H H H H H H H H H
charge: -0.023815 0.112504 0.364794 0.405812 0.587307 -0.543713 -0.688996 -0.796430 -0.826725 -0.821965 -0.832209 0.240889 0.223179 0.228121 0.228058 0.255846 0.255833 0.218202 0.225094 0.233476 0.225223 0.250909 0.250904 0.227703
chargesum: 0.00000
title: Mulliken charges with hydrogens summed into heavy atoms:
elementType: Br C C C C C C C C C C
charge: -0.023815 0.112504 0.364794 0.405812 0.587307 -0.543713 -0.448108 -0.117072 -0.096844 -0.138172 -0.102694
polarizability: 1.73449138e+02 -5.71694256e-01 1.34185089e+02 4.88365961e-03 1.02433688e-03 6.64034160e+01
1716.lowfreq: -39.5726 -0.0003 -0.0001 0.0001 6.6430 9.4271 17.5294 74.1676 96.9873
frequency: -38.7503 74.1534 96.9762 134.7494 159.6172 178.8954 196.6195 200.6106 238.7191 287.2740 302.8421 330.5577 342.3488 396.6270 449.8757 532.5355 535.9493 556.1639 582.6466 586.0480 733.6747 749.2679 878.5880 901.2944 961.4361 993.7276 1015.7864 1017.0710 1036.1525 1041.0198 1047.9916 1054.0628 1077.2526 1160.1691 1243.5610 1312.1804 1346.6539 1377.2172 1389.2780 1400.6018 1402.6343 1409.1032 1434.7061 1457.7743 1461.2050 1465.6211 1469.7895 1475.7264 1482.1039 1484.0278 1493.2850 1567.6168 1605.9393 2966.6864 2973.6686 2979.1941 2987.3308 3036.3053 3041.0689 3056.8661 3058.3531 3080.9445 3085.5401 3110.1049 3122.2182 3122.7824
redmass: 1.1370 2.5388 1.9989 1.2659 1.5552 1.0238 5.8290 1.4881 6.5329 3.5809 2.6212 2.9935 3.6405 2.6978 4.8918 2.8353 3.1277 4.3228 4.6585 3.9798 3.2737 3.7478 1.2969 2.4249 3.3112 1.3337 1.3821 1.7386 1.7111 1.5183 1.5279 1.6941 2.0002 4.4591 1.4780 6.8812 6.3610 4.4961 1.2618 1.2088 1.2361 1.2750 2.1522 1.0621 1.0456 1.0444 1.0441 1.1533 1.2207 1.0454 1.2182 5.4848 6.3878 1.0379 1.0414 1.0368 1.0405 1.0968 1.0968 1.0970 1.0972 1.0980 1.0995 1.0965 1.0910 1.0914
irintensity: 0.1290 0.0804 0.6980 0.2153 6.1488 0.0028 0.0738 1.5288 4.3084 2.1604 0.4161 0.0037 0.1650 0.2969 1.1876 1.7101 1.9978 2.8290 3.2124 0.0412 0.0997 7.7014 11.0987 18.3831 61.9774 4.4760 9.7294 15.4816 1.2182 0.3064 8.4304 5.7939 7.1671 11.1572 0.2753 0.0416 4.5095 10.7651 1.0993 14.2474 14.7035 10.5637 10.6600 6.4313 3.3971 12.8215 0.0361 29.3610 18.7790 36.1114 31.8422 5.9381 0.3405 49.8875 28.8653 25.3820 19.2018 42.2295 0.0256 13.3824 14.8973 21.3061 21.4227 11.7731 38.8778 19.1774
temp: 298.150 k
press: 1.00000 atm
elementType: 35 6 6 6 6 6 6 6 6 6 6 1 1 1 1 1 1 1 1 1 1 1 1 1
symmnumber: 1
zpe: 518885.0 jmol-1
zpe.correction: 0.197633 hartree
zpe.thermalcorrener: 0.209373 hartree
zpe.thermalcorrenthalpy: 0.210317 hartree
zpe.thermalcorrgfe: 0.159695 hartree
zpe.sumelectzpe: -401.510047 hartree
zpe.sumelectthermal: -401.498307 hartree
zpe.sumelectthermalent: -401.497363 hartree
zpe.sumelectthermalfe: -401.547986 hartree
dipole: -2.3738 0.0507 0.0001
dipole: 2.3744
quadrupole: -71.9837 -68.9058 -79.0789
quadrupole: 1.2466 0.0032 -0.0023
quadrupole: 1.3391 4.4170 -5.7561 1.2466 0.0032 -0.0023
hfenergy: -401.7076803 hartree
pointgroup: C01 [X(C10H13Br1)]
dipole: 0.9032845 -0.2366283 0.0268371 debye
dipolederiv: -0.6535875 0.2399841 -0.0203538 0.2544995 -0.1807372 0.0092589 -0.0208953 0.0090392 -0.0619231 0.172017 0.2246252 -0.0011262 0.113908 -0.0676928 0.0020653 0.0028883 0.004753 -0.084315 -0.3033548 -0.0810803 -0.0046487 0.0987583 0.1957376 -0.0033627 -0.0102292 -0.0072625 0.0190989 0.2366959 -0.1345611 0.0091527 -0.1870041 0.0543748 -0.0061629 0.0102278 -0.0047933 -0.0155672 -0.0734667 0.3221787 -0.0126969 0.1946449 -0.0028814 0.0054624 -0.0088764 0.008004 0.0381717 0.9569691 -0.462122 0.0394759 -0.505809 0.0960608 -0.0199423 0.0409825 -0.0190626 -0.1877719 -0.1337772 -0.0959792 0.0047918 0.0364321 -0.0242935 -0.00493 0.0007455 -0.0076365 -0.2148793 -0.143812 -0.0892009 -0.0021464 -0.0100909 0.0263824 0.0012602 -0.0047524 -0.0008015 0.0771933 0.0401269 0.1020859 -0.003494 0.0877896 -0.1436703 0.0081447 -0.0030031 0.0083166 0.0564301 -0.1183254 0.0887272 -0.0065945 0.0248082 0.061784 0.0005324 -0.0041543 0.0016162 0.064901 -0.1089114 -0.1097778 0.0000034 -0.0807438 0.0749523 -0.0024455 -0.0007508 -0.0028779 0.054037 0.0463618 0.02999 -0.0031537 0.0255486 -0.1288184 0.0090688 -0.0028519 0.0090436 0.149268 0.1180125 0.0621394 -0.0015855 -0.0329232 -0.153798 0.0072608 0.0013664 0.0093322 0.1006892 -0.0468852 -0.0218159 -0.0869139 0.0111889 0.0765524 0.0668874 -0.1304884 0.0228815 -0.0533129 -0.056508 -0.0151031 0.0878565 0.0224673 0.0706823 -0.0735176 0.1291788 -0.0309749 -0.0374471 0.0541313 0.0530327 -0.0912871 0.0177453 0.0240254 0.0209148 -0.0808581 0.0644361 -0.0360565 0.0467628 0.0614641 0.0911144 0.0237693 0.0185279 -0.0232202 0.082875 -0.0651215 -0.0232682 -0.0816604 -0.1775578 0.0016863 -0.0932111 0.0283429 0.0001683 -0.0009924 -0.0015957 0.098923 -0.0418745 0.0153185 -0.0848289 -0.0258042 0.0680914 -0.0859262 -0.1359818 -0.0342098 -0.0480652 0.0860383 -0.0791426 0.0021008 0.043375 -0.1572706 0.0094907 -0.0018272 0.0068483 0.1080938 -0.0509456 0.0196451 0.0837898 -0.0201395 0.0751592 0.0772527 0.1372774 0.027392 -0.0462852 -0.0103103 -0.0369021 0.087428 -0.000054 0.0655456 -0.0540175 0.1127883 -0.0100578 -0.026489 -0.0020872 -0.0423099 -0.0838855 -0.0089662 0.0691193 0.047792 -0.1115281 0.0023122 -0.0382033 0.0683908 0.126362 -0.0046842 0.0098108 -0.1461759 0.0079655 -0.0011407 0.0104191 0.1067779 unknown
polarizability: 171.0031351|-9.3426418|136.5028991|2.5406324|-2.3728478|66.531609 unknown
InChI: InChI=1S/C10H13Br/c1-6-5-7(2)10(11)9(4)8(6)3/h5H,1-4H3
charge 0 multiplicity 1
24 atoms
Br -3.001159 1.124987 -0.109079
C  1.235496 0.563912 0.000241
C  -0.06052 1.170005 -0.046386
C  1.347571 -0.860992 0.046406
C  -1.119409 -1.101539 0.001607
C  -1.194945 0.30997 -0.044096
C  0.182384 -1.656975 0.04636
C  2.524592 1.373174 0.004056
C  -0.267091 2.674453 -0.097568
C  2.708065 -1.534487 0.09538
C  -2.337503 -2.00278 0.003795
H  0.28044 -2.748804 0.081673
H  2.362262 2.459624 -0.033491
H  3.121004 1.160547 0.91254
H  3.161464 1.105125 -0.86124
H  -0.829597 2.963681 -1.004761
H  -0.867369 3.018712 0.765119
H  0.677721 3.236175 -0.094917
H  3.289527 -1.223585 0.985099
H  2.604512 -2.632405 0.128682
H  3.325125 -1.281106 -0.788682
H  -2.992048 -1.796035 0.87097
H  -2.955188 -1.850141 -0.900825
H  -2.037032 -3.063816 0.042517
