program: Gaussian 09
title: 000219647
version: EM64L-G09RevD.01
frameworkgroup: C1[X(C8H16ClNO)]
method: RPBEPBE
basis: SDD
operation: Freq
keyword: #p
keyword: freq=noraman
keyword: PBEPBE/SDD
title: #p freq=noraman PBEPBE/SDD
converged: YES YES NO NO
title: Mulliken charges:
elementType: Cl O N C C C C C C C C H H H H H H H H H H H H H H H H
charge: -0.018639 -0.251556 -0.119876 -0.384001 -0.349469 -0.337537 -0.345863 0.286242 -0.671441 -0.680349 -0.714804 0.220572 0.221483 0.253386 0.197053 0.206403 0.209857 0.241590 0.187628 0.211081 0.228581 0.211174 0.221170 0.222674 0.203611 0.273773 0.277256
chargesum: 0.00000
title: Mulliken charges with hydrogens summed into heavy atoms:
elementType: Cl O N C C C C C C C C
charge: -0.018639 -0.251556 -0.119876 0.058053 0.100970 0.078723 0.083354 0.286242 -0.020605 -0.032893 -0.163774
polarizability: 1.23937426e+02 -6.95862255e+00 1.14850883e+02 -1.30962364e+00 5.39275512e+00 7.92349777e+01
1716.lowfreq: -8.1205 -0.0026 -0.0023 -0.0018 5.7501 13.6643 40.7674 45.5205 60.9621
frequency: 40.6729 45.4130 60.8585 87.1970 91.4644 99.0705 122.7650 187.4678 218.0725 224.4639 243.6327 261.4126 286.5426 318.7353 362.1357 416.7752 521.2519 557.4590 628.6607 738.3484 749.1533 755.2271 778.3904 864.9371 867.8841 887.8052 892.2358 923.4496 984.4308 1045.3127 1050.1792 1091.7757 1102.8394 1110.7479 1137.8525 1157.2494 1207.0011 1218.3499 1262.0095 1269.9565 1289.2283 1295.6247 1301.6185 1309.0191 1358.0494 1363.8885 1392.9170 1395.1485 1403.6030 1427.3731 1452.1833 1474.0141 1474.7435 1479.1136 1480.1601 1482.1198 1486.9072 1496.2056 1608.2440 2975.3984 2977.8483 2980.5088 2984.9252 2994.3381 2996.8956 3026.9470 3036.5566 3041.3377 3052.5583 3066.2833 3074.5210 3079.3916 3081.7233 3083.2523 3115.8369
redmass: 5.9177 3.4928 4.3027 3.2871 1.9327 1.8861 2.0065 3.8729 1.2653 1.1620 2.9908 3.9518 2.8481 3.4268 3.0476 3.4928 3.5588 3.7025 4.1037 1.5770 1.1111 2.3016 4.4521 1.3725 1.2775 1.7327 1.7170 1.8954 2.9262 2.9693 2.8860 1.6911 2.1212 2.2043 1.8483 1.1241 2.5179 1.4896 1.3514 1.3225 1.1884 1.3150 1.3099 1.2552 1.3584 1.3845 1.2092 1.2075 2.3980 1.0893 1.1027 1.0549 1.0563 1.0425 1.0482 1.0860 1.0763 1.1019 7.7251 1.0364 1.0363 1.0631 1.0610 1.0614 1.0626 1.0976 1.0596 1.0951 1.1019 1.1003 1.1017 1.0998 1.1026 1.0990 1.1072
irintensity: 0.1648 0.5471 1.6431 1.0131 3.1217 0.0702 4.1223 0.3110 0.0589 0.1820 0.3177 0.2010 0.5718 2.2514 10.2822 6.0965 3.6781 6.9802 5.8444 28.9169 13.0321 22.1570 0.9627 0.3770 1.5083 24.4439 1.1212 3.4992 1.9567 0.5769 0.1864 24.2828 3.4322 4.2063 75.3839 3.7551 19.9261 45.4896 8.7528 8.7202 7.2183 4.1565 0.4890 14.4614 2.5378 5.7564 13.0012 14.1328 86.8336 14.8144 12.9625 2.2384 3.3073 10.6847 12.9337 4.6371 20.9672 16.7959 223.8544 39.0373 29.9442 15.7358 1.0329 72.7667 26.3152 0.5581 18.1979 2.1688 13.8107 12.7658 78.6200 46.7984 54.9647 38.4489 7.5860
temp: 298.150 k
press: 1.00000 atm
elementType: 17 8 7 6 6 6 6 6 6 6 6 1 1 1 1 1 1 1 1 1 1 1 1 1 1 1 1
symmnumber: 1
zpe: 606552.6 jmol-1
zpe.correction: 0.231024 hartree
zpe.thermalcorrener: 0.244990 hartree
zpe.thermalcorrenthalpy: 0.245934 hartree
zpe.thermalcorrgfe: 0.188653 hartree
zpe.sumelectzpe: -903.582172 hartree
zpe.sumelectthermal: -903.568206 hartree
zpe.sumelectthermalent: -903.567262 hartree
zpe.sumelectthermalfe: -903.624542 hartree
dipole: -3.5125 4.8449 1.6153
dipole: 6.1984
quadrupole: -79.5906 -78.9574 -74.6402
quadrupole: 5.9406 2.2491 -1.9705
quadrupole: -1.8612 -1.2280 3.0892 5.9406 2.2491 -1.9705
hfenergy: -903.8131958 hartree
pointgroup: C01 [X(C8H16Cl1N1O1)]
dipole: 0.6345042 2.2672946 -0.635385 debye
polarizability: 118.3354303|8.2204281|120.4696729|0.496662|-5.4977382|79.2181827 unknown
InChI: InChI=1S/C8H16ClNO/c1-3-5-10(6-4-2)8(11)7-9/h3-7H2,1-2H3
charge 0 multiplicity 1
27 atoms
Cl -3.203851 -2.255191 -0.003225
O  -0.249181 -2.153221 0.564542
N  0.171232 0.069654 0.022771
C  -0.237243 1.388383 -0.511721
C  1.566691 -0.068998 0.510144
C  -0.755395 2.366583 0.572092
C  2.534997 -0.573978 -0.584748
C  -0.652635 -1.049253 0.097222
C  -1.100518 3.75014 -0.018635
C  3.983932 -0.673632 -0.062971
C  -2.078783 -0.845503 -0.459493
H  -1.003651 1.261417 -1.298728
H  0.641935 1.836576 -1.014467
H  1.56518 -0.782639 1.352505
H  1.898481 0.916757 0.890221
H  -1.645757 1.931475 1.06655
H  0.015689 2.472832 1.359639
H  2.185446 -1.565583 -0.92608
H  2.494739 0.106239 -1.459423
H  -1.892275 3.67418 -0.787765
H  -1.461632 4.437439 0.766698
H  -0.215435 4.215756 -0.491865
H  4.048382 -1.369258 0.794359
H  4.664347 -1.046475 -0.849317
H  4.362167 0.311507 0.271116
H  -2.554867 0.063996 -0.063952
H  -2.067194 -0.810502 -1.561469
