program: Gaussian 09
title: 000219646
version: EM64L-G09RevD.01
frameworkgroup: C1[X(C7H14BrNO)]
method: RPBEPBE
basis: SDD
operation: Freq
keyword: #p
keyword: freq=noraman
keyword: PBEPBE/SDD
title: #p freq=noraman PBEPBE/SDD
converged: YES YES NO NO
title: Mulliken charges:
elementType: Br O N C C C C C C C H H H H H H H H H H H H H H
charge: -0.030733 -0.272568 -0.110915 -0.350238 -0.388096 0.327592 -0.548576 -0.655610 -0.642816 -0.642647 0.258113 0.204623 0.250988 0.228833 0.294267 0.206789 0.258256 0.216541 0.221718 0.216710 0.223308 0.275930 0.233132 0.225399
chargesum: 0.00000
title: Mulliken charges with hydrogens summed into heavy atoms:
elementType: Br O N C C C C C C C
charge: -0.030733 -0.272568 -0.110915 0.112498 0.091725 0.327592 -0.254309 0.025977 0.018920 0.091814
polarizability: 1.14031624e+02 -3.11224958e+00 9.40082984e+01 -2.11854622e+00 -3.61525813e+00 1.00595334e+02
1716.lowfreq: -8.1664 -0.0006 -0.0003 0.0002 4.0414 15.9396 53.5277 57.7012 70.8808
frequency: 53.5130 57.6849 70.8498 88.4223 121.7176 165.8429 205.8010 217.0591 227.6766 245.7382 268.1115 312.0083 346.5842 386.1331 422.5548 516.8492 525.8024 582.7483 708.1149 723.2241 781.1032 788.1232 883.0876 940.1722 982.8596 1013.0831 1055.7927 1072.9651 1080.3418 1091.0344 1098.1324 1132.2232 1187.0063 1210.2873 1247.8570 1296.8128 1317.9862 1342.3751 1356.2174 1386.4962 1392.2200 1392.4516 1412.3750 1452.3678 1455.0479 1462.1301 1467.8956 1469.7705 1479.0300 1484.4753 1502.9380 1583.9919 2983.0147 2985.3389 2988.9114 3004.7897 3010.2439 3060.7331 3069.4847 3079.1108 3083.1893 3085.7686 3086.5524 3090.3861 3103.7637 3131.4962
redmass: 3.8468 3.7579 3.5911 2.6706 5.1002 3.9431 1.5826 1.0630 1.0677 1.9270 2.1540 2.9372 3.3607 2.8861 3.3670 4.3809 3.0333 3.4843 4.5428 3.7242 1.1754 1.1861 2.3912 2.0670 1.4829 2.6263 1.4494 2.0399 1.8314 2.5084 1.7877 1.6175 1.5374 2.8732 1.4722 1.3072 1.4284 1.2599 1.2965 1.2170 1.2101 1.2200 2.5554 1.0493 1.1058 1.0569 1.0443 1.0433 1.0511 1.0553 1.0966 6.2224 1.0355 1.0358 1.0403 1.0638 1.0629 1.0988 1.1001 1.0881 1.0994 1.0994 1.0936 1.1003 1.1021 1.1009
irintensity: 0.3503 2.5773 1.9663 0.1828 0.5573 2.6471 0.3065 0.1538 0.4654 0.8335 2.3724 0.9270 14.7400 4.4999 8.4193 36.2688 1.7132 5.4420 2.4803 1.3282 5.8228 9.3935 8.1353 6.5743 18.8652 3.1625 23.1488 8.3345 5.7559 16.4443 23.6222 53.8087 12.4678 26.4300 49.5921 11.0262 8.9128 4.8564 10.2872 13.6808 25.8908 30.5312 65.7752 14.3970 18.1926 23.4958 4.1160 16.2623 6.5208 12.7230 6.8551 234.7125 21.4740 24.5710 12.1902 27.2077 34.6982 0.3017 7.5865 6.8527 37.2451 48.2122 26.2260 25.3395 27.0545 9.0988
temp: 298.150 k
press: 1.00000 atm
elementType: 35 8 7 6 6 6 6 6 6 6 1 1 1 1 1 1 1 1 1 1 1 1 1 1
symmnumber: 1
zpe: 531308.6 jmol-1
zpe.correction: 0.202365 hartree
zpe.thermalcorrener: 0.215111 hartree
zpe.thermalcorrenthalpy: 0.216055 hartree
zpe.thermalcorrgfe: 0.162149 hartree
zpe.sumelectzpe: -417.770025 hartree
zpe.sumelectthermal: -417.757279 hartree
zpe.sumelectthermalent: -417.756335 hartree
zpe.sumelectthermalfe: -417.810241 hartree
dipole: -2.5084 3.6211 0.0523
dipole: 4.4054
quadrupole: -67.0063 -74.5215 -71.2106
quadrupole: -1.6003 4.7215 3.7938
quadrupole: 3.9065 -3.6087 -0.2978 -1.6003 4.7215 3.7938
hfenergy: -417.9723899 hartree
pointgroup: C01 [X(C7H14Br1N1O1)]
dipole: -0.937175 1.433415 0.2665059 debye
dipolederiv: -0.2888062 -0.0047628 0.0931294 0.0005429 -0.1500749 -0.0278482 0.1465133 0.0105196 -0.610884 -0.6868255 0.0165939 0.0375354 0.3305139 -0.9048955 0.3082018 -0.1758755 0.2673482 -0.4446949 -1.0130542 0.3021957 -0.0836385 0.1354491 -0.7413822 0.031453 -0.0427873 0.0669847 -0.3623674 0.4623833 0.1479498 -0.0142739 0.2051611 0.2755137 0.0531188 -0.1399777 0.0898768 0.2160824 0.1140707 -0.0619841 0.0244341 -0.1309583 0.5945913 0.0126823 0.1074812 -0.0826283 0.2232967 1.2708764 -0.4039975 -0.0830715 -0.445246 0.8855747 -0.5017321 0.1602575 -0.3457869 0.2097624 0.1359652 -0.0715081 0.0438222 -0.0958558 0.0914913 0.1316453 -0.0654672 0.0997589 0.8694206 -0.0393717 -0.0205647 -0.0025903 -0.0423336 -0.013485 -0.0723285 0.0117196 -0.1135316 -0.0242807 0.0801591 0.0145423 -0.0026997 0.0341432 -0.0901961 -0.0617328 -0.0075712 -0.0879839 -0.0184128 -0.0704956 0.0414346 -0.0219796 0.0153175 0.0093187 -0.0171425 -0.0887096 0.0223503 -0.2055037 0.0819455 0.0104787 -0.0740049 -0.0645831 0.0223018 0.0674584 0.0017745 0.0373208 -0.0428303 -0.0817317 0.0749232 0.0454518 0.0973623 -0.0633262 -0.0924071 0.0269347 -0.0620105 0.0632253 0.0177954 -0.0578445 0.0990669 -0.0245236 0.002101 0.0061673 0.0644869 0.0209789 0.009047 -0.0753291 0.0235635 -0.1234406 0.0027932 0.0127981 -0.0452252 -0.1120839 -0.0065437 0.0033198 0.0302174 0.0479286 0.0252822 0.0112467 -0.0991912 0.0002335 0.0319905 -0.0408774 -0.0698878 0.0950453 0.0104658 -0.0265461 0.0388831 0.000544 0.1240507 -0.0494706 0.0770363 -0.0911962 0.015163 0.1217999 0.0373379 0.0812666 0.0080484 -0.0462551 0.0177293 -0.0181296 0.0669453 -0.1291935 -0.1271621 0.0434462 -0.143447 0.0312804 0.015171 0.040912 0.0282995 0.070274 -0.0601396 -0.0128936 0.1235419 -0.0647019 0.0914992 0.0378574 0.1051703 -0.0025978 -0.0035974 -0.0904317 -0.0379162 -0.118524 0.0022503 0.0822964 -0.001892 -0.0973984 -0.0283291 0.0167056 0.0908627 0.0441751 -0.0132443 0.0681139 -0.1515426 0.0749123 -0.0195267 0.1057571 0.0313111 0.13913 -0.0098359 -0.0171035 0.0602789 -0.0419742 -0.0096143 -0.0025694 -0.0276581 0.119079 -0.0845071 -0.0729052 0.0160274 -0.1023462 0.0551887 0.0384501 0.0689236 0.039458 0.0944644 0.0862721 0.0253237 -0.0079587 0.0306729 0.09352 -0.0252241 0.0175441 -0.049612 -0.1192785 unknown
polarizability: 111.2855803|-4.3027781|93.6838386|-5.60924|-1.8679818|103.6658381 unknown
InChI: InChI=1S/C7H14BrNO/c1-4-9(5-2)7(10)6(3)8/h6H,4-5H2,1-3H3
charge 0 multiplicity 1
24 atoms
Br 2.074162 0.026921 -1.996108
O  0.47174 -1.622267 0.885414
N  -0.817454 0.153422 0.112165
C  -2.052004 -0.598143 0.458365
C  -0.99093 1.477083 -0.531823
C  0.39872 -0.464629 0.360605
C  1.6845 0.31245 0.01958
C  -2.511431 -1.525104 -0.687045
C  -1.136583 2.632149 0.484096
C  2.886156 -0.168202 0.82559
H  -1.839257 -1.200081 1.357725
H  -2.837839 0.138693 0.708267
H  -0.154988 1.668846 -1.225455
H  -1.899288 1.419251 -1.160861
H  1.556471 1.404257 0.078533
H  -2.707234 -0.956893 -1.615037
H  -1.734775 -2.280112 -0.895112
H  -3.441385 -2.051345 -0.403622
H  -1.983247 2.453673 1.171253
H  -0.223232 2.7450 1.095885
H  -1.318082 3.586607 -0.043387
H  2.999226 -1.259265 0.734517
H  3.809845 0.335732 0.496819
H  2.716308 0.060359 1.896039
