program: Gaussian 09
title: 000219645
version: EM64L-G09RevD.01
frameworkgroup: C1[X(C6H12ClNO)]
method: RPBEPBE
basis: SDD
operation: Freq
keyword: #p
keyword: freq=noraman
keyword: PBEPBE/SDD
title: #p freq=noraman PBEPBE/SDD
converged: YES YES NO NO
title: Mulliken charges:
elementType: Cl O N C C C C C C H H H H H H H H H H H H
charge: -0.088570 -0.266664 -0.346578 -0.330982 -0.391326 -0.352390 -0.683977 0.281410 -0.652307 0.217542 0.197757 0.212518 0.257680 0.192261 0.200535 0.321976 0.214179 0.218215 0.209537 0.294038 0.295147
chargesum: 0.00000
title: Mulliken charges with hydrogens summed into heavy atoms:
elementType: Cl O N C C C C C C
charge: -0.088570 -0.266664 -0.024602 0.084317 0.078872 0.040406 -0.042047 0.281410 -0.063122
polarizability: 9.51083872e+01 -2.53188624e-01 9.12794685e+01 -6.15369412e+00 -6.42905524e+00 6.58956732e+01
1716.lowfreq: -2.6017 -0.0025 -0.0013 0.0019 5.5930 9.9363 20.3431 45.2836 69.8953
frequency: 19.6488 45.2687 69.8693 82.4752 135.2986 168.2012 223.2467 235.1092 283.6645 334.5832 386.0030 488.4587 571.1554 600.3819 660.1037 663.3695 737.1923 798.6631 848.2368 889.1453 906.3270 974.2488 977.9449 1049.7127 1106.3852 1122.7208 1136.9961 1149.5340 1228.4737 1244.1892 1253.5673 1271.3170 1291.0551 1314.0055 1351.4149 1365.7785 1391.6190 1418.2972 1457.7276 1459.7483 1474.0287 1478.1406 1485.8295 1512.8134 1613.2832 2962.6917 2975.6591 2980.5725 2995.5515 3008.5464 3046.1890 3072.4203 3072.5990 3075.5982 3076.5023 3155.0350 3514.4572
redmass: 4.5536 4.8194 1.6693 2.9364 2.7028 5.0437 2.1666 1.4648 2.4800 3.5054 6.7274 2.4614 3.2541 3.6765 1.1231 5.7550 1.2144 1.7513 2.0553 1.7247 1.7252 1.7920 1.8450 3.0406 3.5167 2.1170 1.7835 1.1795 1.3169 1.6841 1.2096 1.4853 1.1118 1.2339 1.4556 1.3595 1.2107 1.0913 1.0904 1.0859 1.0626 1.0426 1.0775 1.9525 8.1814 1.0591 1.0366 1.0603 1.0655 1.0977 1.1009 1.0631 1.0936 1.1002 1.1004 1.1094 1.0774
irintensity: 0.6639 2.4161 0.2959 14.2618 2.8195 4.5216 5.6444 4.3866 2.3667 4.6796 11.7485 1.3439 6.3468 6.3510 111.5628 70.7350 20.5370 2.4950 1.3694 2.5831 9.3355 11.1792 5.5911 1.9253 5.3339 4.7843 2.7701 0.0116 3.3489 6.6431 18.9477 42.5784 0.0893 18.1786 0.9340 3.0072 9.9677 28.2500 24.1999 7.1959 7.0217 11.6528 15.1466 199.6901 225.4419 26.4936 27.2421 49.6209 32.6909 3.6267 42.3114 19.0840 55.7092 14.2802 49.3520 1.3257 43.0508
temp: 298.150 k
press: 1.00000 atm
elementType: 17 8 7 6 6 6 6 6 6 1 1 1 1 1 1 1 1 1 1 1 1
symmnumber: 1
zpe: 461824.7 jmol-1
zpe.correction: 0.175900 hartree
zpe.thermalcorrener: 0.187022 hartree
zpe.thermalcorrenthalpy: 0.187966 hartree
zpe.thermalcorrgfe: 0.136505 hartree
zpe.sumelectzpe: -825.153470 hartree
zpe.sumelectthermal: -825.142348 hartree
zpe.sumelectthermalent: -825.141404 hartree
zpe.sumelectthermalfe: -825.192865 hartree
dipole: -1.6290 -1.4587 1.0598
dipole: 2.4300
quadrupole: -59.4288 -72.6441 -61.1781
quadrupole: -0.5482 -1.8617 2.9088
quadrupole: 4.9882 -8.2271 3.2389 -0.5482 -1.8617 2.9088
hfenergy: -825.3293698 hartree
pointgroup: C01 [X(C6H12Cl1N1O1)]
dipole: -0.7335516 -0.1799807 0.5860903 debye
dipolederiv: -0.2416974 0.0091577 0.035323 0.1474663 -0.4993441 0.2230235 -0.0862056 0.3027928 -0.4019169 -0.6765145 0.1647919 0.0218925 -0.146143 -0.6787702 0.3749055 0.3746381 0.1801352 -0.7274584 -1.1431822 0.07465 0.2076534 0.1393945 -0.4403557 -0.0803829 0.2729403 -0.0453723 -0.5890725 0.0229662 -0.0519694 -0.0276997 -0.0133419 0.0730738 -0.0308949 -0.0471056 -0.0045496 0.0672575 0.4586806 -0.1218372 0.0321091 -0.3328203 0.2639436 0.1432495 0.1282968 0.0533354 0.2230789 0.0544022 -0.0496414 -0.0552334 -0.0547636 0.0910122 0.0315615 -0.0760973 0.0380702 0.1123627 -0.0171181 -0.0565229 -0.033137 -0.0684512 0.057403 -0.0126824 -0.0076116 -0.003002 0.0629175 1.2196002 -0.3491183 -0.3244106 0.0393199 0.5681337 -0.3725576 -0.8363239 -0.1292546 0.775706 -0.0140259 0.2041581 -0.0648597 0.0290755 0.4373677 -0.2931052 0.1086918 -0.4038805 0.4866703 0.0519668 -0.0125697 0.0552904 -0.0228216 0.0283177 -0.0791912 0.0400882 -0.0477041 -0.1190337 -0.1009083 0.135093 -0.0210197 0.0965027 -0.0863274 0.0414256 -0.0185153 0.027691 0.0801673 -0.0141021 0.0647016 0.0381068 0.0793389 0.0564954 -0.0563432 0.0164379 -0.1172674 -0.1256448 0.0213628 -0.0981221 0.027159 -0.0155776 -0.0045543 0.019251 -0.0140888 0.0961786 0.0733414 0.0421266 -0.0164855 0.0277605 -0.0046603 0.0196686 -0.1043528 0.0376197 -0.0674707 -0.1781228 -0.0591114 0.1226216 -0.0431045 0.1258073 -0.0804807 0.0383725 -0.0242938 0.0311825 0.0532454 0.2917039 -0.0068087 0.0753322 0.0171061 0.2367694 0.052268 0.0947076 0.0354956 0.2342492 0.0583732 0.0242737 0.0664217 0.0088849 0.0622389 -0.0761966 0.0045645 -0.1015169 -0.1369803 -0.0129287 -0.1023211 0.0393553 -0.1399176 -0.0609074 0.0918687 0.0698085 0.1100539 0.0207367 -0.045121 0.0940405 -0.0318762 0.1600547 -0.0683975 0.021315 -0.0404382 0.0028354 0.0830244 0.1145989 0.0002674 0.0039336 0.0258196 -0.0023777 0.021201 0.0289532 -0.0211977 -0.0437154 -0.0110715 -0.0283591 -0.0289965 -0.0702731 0.0270909 0.0472648 -0.0260666 0.0634451 0.0491876 unknown
polarizability: 94.6591541|-4.5982552|81.335268|-6.2414244|-13.4593517|76.2891068 unknown
InChI: InChI=1S/C6H12ClNO/c1-2-3-4-8-6(9)5-7/h8H,2-5H2,1H3
charge 0 multiplicity 1
21 atoms
Cl 2.146519 -2.138259 1.283098
O  1.630282 0.999589 -1.276207
N  0.356593 0.196802 0.518242
C  -1.996671 0.631023 -0.284107
C  -0.723653 1.192772 0.391433
C  -2.687621 -0.497793 0.514617
C  -3.979349 -0.998787 -0.167098
C  1.432402 0.175781 -0.327284
C  2.496703 -0.905939 -0.124172
H  -1.735739 0.270202 -1.298134
H  -2.708848 1.47054 -0.418771
H  -0.968819 1.57401 1.401754
H  -0.316796 2.027534 -0.205407
H  -2.925033 -0.1318 1.535178
H  -1.988046 -1.349445 0.637081
H  0.302008 -0.527347 1.239874
H  -3.764416 -1.396155 -1.176709
H  -4.459496 -1.803906 0.418304
H  -4.712567 -0.177981 -0.279245
H  2.588862 -1.511477 -1.037133
H  3.460885 -0.437068 0.120283
