program: Gaussian 09
title: 000219644
version: EM64L-G09RevD.01
frameworkgroup: C1[X(C4H5ClO2)]
method: RPBEPBE
basis: SDD
operation: Freq
keyword: #p
keyword: freq=noraman
keyword: PBEPBE/SDD
title: #p freq=noraman PBEPBE/SDD
converged: NO YES NO NO
title: Mulliken charges:
elementType: Cl O O C C C C H H H H H
charge: -0.034115 -0.441850 -0.220554 -0.061052 -0.173769 -0.713863 0.254861 0.267354 0.241723 0.249544 0.241724 0.389996
chargesum: 0.00000
title: Mulliken charges with hydrogens summed into heavy atoms:
elementType: Cl O O C C C C
charge: -0.034115 -0.051853 -0.220554 0.206302 -0.173769 0.019128 0.254861
polarizability: 7.75909912e+01 9.31858136e+00 7.37786132e+01 2.29884938e-03 1.50560918e-03 2.96696515e+01
1716.lowfreq: -10.2195 -6.5202 -5.8525 -0.0017 0.0017 0.0024 59.9105 98.5267 187.3344
frequency: 59.9101 98.4804 187.3337 194.7369 228.8243 382.0257 408.5606 445.3357 565.2377 567.8660 615.3374 705.3123 862.3726 900.6775 982.9268 1041.7835 1079.5088 1143.5866 1283.2050 1313.2079 1392.0388 1454.7455 1461.3314 1636.4423 1663.6575 2977.5926 3048.6646 3110.8148 3131.9256 3533.8461
redmass: 10.4184 1.0340 3.0896 4.2369 9.0345 6.6998 3.2654 7.0900 4.5020 1.2015 4.4475 5.5689 1.2148 3.0623 2.5240 1.5774 2.5940 2.1221 1.6063 1.8755 1.2224 1.0768 1.0469 8.1334 7.7008 1.0384 1.0957 1.0960 1.0910 1.0644
irintensity: 0.0007 0.6883 1.2075 0.7969 0.4206 4.3617 9.9035 1.7313 1.8291 138.2445 71.4253 52.9174 13.6273 142.6436 82.0048 0.0173 114.7553 13.6915 5.0269 42.6586 28.9749 21.9318 18.4005 110.9718 248.5788 9.6552 12.9128 7.2804 3.7746 45.5413
temp: 298.150 k
press: 1.00000 atm
elementType: 17 8 8 6 6 6 6 1 1 1 1 1
symmnumber: 1
zpe: 218182.6 jmol-1
zpe.correction: 0.083101 hartree
zpe.thermalcorrener: 0.090952 hartree
zpe.thermalcorrenthalpy: 0.091896 hartree
zpe.thermalcorrgfe: 0.049954 hartree
zpe.sumelectzpe: -765.380136 hartree
zpe.sumelectthermal: -765.372285 hartree
zpe.sumelectthermalent: -765.371341 hartree
zpe.sumelectthermalfe: -765.413284 hartree
dipole: -1.4862 -3.4897 0.0000
dipole: 3.7930
quadrupole: -41.5842 -48.3201 -48.2124
quadrupole: -3.4203 0.0024 -0.0011
quadrupole: 4.4547 -2.2812 -2.1735 -3.4203 0.0024 -0.0011
hfenergy: -765.4632371 hartree
pointgroup: C01 [X(C4H5Cl1O2)]
dipole: -0.8230545 -1.2447625 -0.0001566 debye
dipolederiv: -0.1011782 0.1175962 0.0000656 -0.0030312 -0.5839871 -0.0001812 0.0000756 -0.0002072 -0.0399009 -0.429933 0.2997825 0.0000519 0.3803317 -1.1516791 -0.0000569 -0.0001541 0.0005686 -0.4355724 -0.9606498 -0.3168877 0.0003273 -0.1234551 -0.6862737 0.0003047 -0.0003929 -0.0002745 -0.3275263 0.5310679 0.0924232 -0.0001719 0.1482471 -0.2164768 -0.0000437 0.0000117 -0.0000625 -0.1180913 -0.7582312 -0.1073827 0.0000012 -0.2058289 0.9088388 0.0004288 0.0002392 0.0003551 -0.0844323 -0.343912 0.0026937 0.0001008 -0.1299203 -0.0042089 -0.0000119 -0.0000474 -0.000015 0.0484213 1.7077687 0.0410077 -0.0002869 -0.2016321 1.2725582 -0.0003691 0.0001794 -0.0004135 0.3036308 0.0798742 -0.0100714 0.0000297 0.0773531 0.0023318 -0.0000873 0.0000983 -0.0000819 0.1581022 0.0280494 -0.0429199 0.0612011 0.0251178 0.095821 0.094264 0.0970686 0.0908465 -0.0160353 0.0809222 -0.0086388 0.0000094 0.0996437 -0.0598149 -0.0000917 0.0000514 -0.0000598 0.1200968 0.0279278 -0.042925 -0.0612748 0.0251516 0.0959497 -0.0941869 -0.0970361 -0.0907366 -0.0160556 0.1382941 -0.0246779 -0.0000533 -0.0919774 0.326941 0.0000311 -0.0000937 0.0000806 0.4073628 unknown
polarizability: 80.7770721|8.0335739|70.5925308|-0.0010015|0.0078811|29.669653 unknown
InChI: InChI=1S/C4H5ClO2/c1-2-3(5)4(6)7/h2,6H,1H3
charge 0 multiplicity 1
12 atoms
Cl -0.556569 1.990873 0.000653
O  1.389987 -1.550012 0.000051
O  2.172772 0.640167 0.00009
C  -1.252046 -0.706194 -0.000154
C  -0.238209 0.201279 -0.000166
C  -2.726475 -0.42758 0.000427
C  1.206173 -0.151808 -0.000808
H  -0.932039 -1.757131 -0.000667
H  -3.201676 -0.88992 0.887198
H  -2.948386 0.650655 0.000883
H  -3.202266 -0.889297 -0.886352
H  2.367235 -1.734533 0.000547
