program: Gaussian 09
title: 000219636
version: EM64L-G09RevD.01
frameworkgroup: C1[X(C7H16N2O)]
method: RPBEPBE
basis: SDD
operation: Freq
keyword: #p
keyword: freq=noraman
keyword: PBEPBE/SDD
title: #p freq=noraman PBEPBE/SDD
converged: YES YES NO NO
title: Mulliken charges:
elementType: O N N C C C C C C C H H H H H H H H H H H H H H H H
charge: -0.317586 -0.443561 -0.665647 0.386207 -0.033099 -0.741092 -0.807362 -0.748526 -0.749416 0.274117 0.264181 0.206612 0.209719 0.269378 0.234485 0.224826 0.219109 0.232452 0.214276 0.203072 0.204343 0.216777 0.226972 0.286401 0.295931 0.337431
chargesum: 0.00000
title: Mulliken charges with hydrogens summed into heavy atoms:
elementType: O N N C C C C C C C
charge: -0.317586 -0.157161 -0.032285 0.386207 0.231082 -0.055382 -0.128941 -0.098726 -0.101323 0.274117
polarizability: 1.06026692e+02 3.15389927e+00 8.26863036e+01 -3.46614859e+00 1.88992882e+00 8.96832642e+01
1716.lowfreq: -10.9384 -0.0010 -0.0009 -0.0007 5.6837 21.3131 52.1765 71.3302 95.1904
frequency: 51.6871 71.3116 95.0774 166.0569 186.2018 200.7153 217.5520 238.8339 256.6052 283.0379 288.6517 331.6606 344.4818 360.8110 382.0193 434.7297 440.0719 503.1273 507.0934 522.7049 632.6913 700.4301 722.4276 858.6013 890.9850 912.4935 923.3935 930.1654 957.7031 995.7436 1027.0409 1044.3015 1075.9503 1126.2269 1154.9437 1183.2098 1208.8589 1233.0453 1306.4547 1337.6462 1349.7262 1369.5561 1372.3090 1383.9236 1396.5008 1456.4150 1464.3226 1468.8931 1479.0413 1482.1840 1486.6389 1489.6525 1494.1218 1498.7327 1596.8667 1642.1616 2972.3584 2975.5019 2981.4569 2990.2985 3005.1823 3058.8390 3065.2817 3069.3811 3075.3239 3079.7285 3086.7197 3098.9976 3106.5711 3534.7924 3544.3135 3699.3167
redmass: 2.5149 4.4860 3.2058 1.9351 1.2354 1.1195 1.5709 1.0412 1.2295 2.6246 1.7987 2.5090 2.9133 2.4389 2.6245 2.1502 1.2958 2.3065 1.3079 2.4529 3.4515 3.1633 8.3355 2.5372 2.2101 1.3191 1.5001 1.6735 1.4005 1.3178 2.7174 1.7413 1.5461 2.6674 2.0894 2.2010 3.2135 2.4878 1.8523 1.3417 1.7126 1.2123 1.2087 1.2312 1.2161 1.0994 1.0827 1.0487 1.0633 1.1348 1.0573 1.1943 1.0838 1.3528 1.3708 3.1555 1.0358 1.0374 1.0366 1.0359 1.0834 1.0988 1.0988 1.0984 1.0994 1.0992 1.0978 1.0972 1.1001 1.0620 1.0602 1.1039
irintensity: 0.2218 18.6182 1.9557 6.4386 2.2021 8.6019 2.5590 0.8159 0.3357 1.4943 0.6599 1.1926 2.4321 2.4356 1.3751 57.5422 340.4995 2.9229 5.4862 6.8347 1.6339 0.5987 22.1293 2.3553 0.4894 2.4799 2.4684 2.9779 0.0242 2.8196 9.3179 1.9149 12.3936 8.3145 45.6680 20.8909 29.6539 9.5387 127.4938 0.1920 46.0962 4.2176 41.9903 28.0818 33.9883 46.7873 38.0904 1.4898 1.7968 80.8713 1.7155 117.3027 25.4710 145.2935 93.9105 244.5530 29.5856 32.8659 29.6355 27.0420 0.5748 3.5599 76.8041 27.8294 20.7221 70.5172 22.9069 31.0271 15.0135 27.5705 13.9048 33.0740
temp: 298.150 k
press: 1.00000 atm
elementType: 8 7 7 6 6 6 6 6 6 6 1 1 1 1 1 1 1 1 1 1 1 1 1 1 1 1
symmnumber: 1
zpe: 597414.2 jmol-1
zpe.correction: 0.227543 hartree
zpe.thermalcorrener: 0.240521 hartree
zpe.thermalcorrenthalpy: 0.241465 hartree
zpe.thermalcorrgfe: 0.189583 hartree
zpe.sumelectzpe: -460.266727 hartree
zpe.sumelectthermal: -460.253748 hartree
zpe.sumelectthermalent: -460.252804 hartree
zpe.sumelectthermalfe: -460.304686 hartree
dipole: -0.4662 1.0592 4.0158
dipole: 4.1792
quadrupole: -54.5935 -64.4691 -64.1877
quadrupole: -0.0234 -8.5655 0.4111
quadrupole: 6.4899 -3.3857 -3.1042 -0.0234 -8.5655 0.4111
hfenergy: -460.4942697 hartree
pointgroup: C01[X(C7H16N2O1)]
dipole: -0.1387906 0.4769329 1.5674033 debye
dipolederiv: -0.7574053 -0.0630407 0.0099182 -0.0599466 -0.4647933 -0.1788664 0.0083368 -0.1703211 -0.9847616 -1.19869 -0.1735658 -0.1409588 -0.2799405 -0.6531715 -0.0773538 -0.448162 -0.1189064 -0.453638 -1.2507152 -0.017051 0.293274 -0.0331292 -0.6850732 0.2203279 0.3883214 0.2340642 -0.4726029 0.7410536 0.0634651 -0.023194 0.0341893 0.3525997 -0.0168878 -0.1393674 -0.0352373 0.2373976 -0.0137497 -0.0509148 -0.0536668 -0.0297885 0.0710521 -0.0400439 -0.0421349 0.0045889 0.0254616 -0.0446229 -0.0041094 -0.0615576 -0.0213701 -0.0790215 0.0760446 0.0046414 0.0486533 -0.0996842 -0.0695433 -0.0334899 -0.0346403 -0.034971 -0.0012558 -0.059869 -0.0449179 -0.064146 -0.0377718 -0.0439436 0.0061755 0.0790411 0.0691698 0.025534 0.0216853 0.0948783 0.0404138 0.0573558 0.0436755 0.0482257 0.0548721 0.0410525 -0.0569546 0.1053794 0.0653509 0.0648146 0.0062555 2.0490816 0.3519475 -0.1901943 0.4611268 0.5041443 0.2548024 0.0176817 0.29928 1.3074867 0.0681943 -0.049008 -0.0559278 -0.0438453 0.0230349 -0.0192143 -0.0426217 -0.0355498 -0.0292787 0.0268002 0.1318049 0.0247615 0.1139081 -0.1086975 -0.0115794 0.0423313 -0.0722632 0.0517169 -0.1451503 -0.0891174 0.0804584 -0.0780698 0.078862 0.0293454 0.0657955 0.0339112 0.0691569 0.1017253 -0.0029842 -0.0777491 -0.0084784 0.0879276 -0.0853557 -0.0663101 -0.0376669 -0.0163266 -0.1232396 -0.0598675 0.0255426 -0.0387849 0.1060567 0.0175091 0.0680733 0.0315439 0.0765804 0.0845131 -0.0077301 0.0048986 -0.0053338 0.017706 0.142289 -0.0225999 0.1054319 -0.1001639 0.0426035 0.1288883 0.0495784 0.0903036 -0.1164251 -0.0750763 0.0119974 -0.0475219 0.060971 0.0802954 -0.0216363 -0.0093831 -0.0466396 0.0038237 0.1469589 0.0113335 0.125367 -0.0809196 0.0072408 0.074803 0.0304566 0.1331338 -0.1309097 -0.0861089 0.0367662 -0.0541915 0.0731373 -0.0355151 -0.0641842 -0.0657049 -0.0997562 0.0448251 -0.0558968 -0.13402 -0.0718129 -0.0444149 -0.0386722 -0.0387451 -0.1317288 -0.080001 0.0581588 -0.0702081 -0.1113945 -0.0134476 -0.056446 0.0596417 0.0872736 0.007647 0.0863027 -0.1501841 -0.0433401 0.0260649 -0.093747 0.0516728 -0.1019481 -0.0676304 0.1185395 -0.0451208 0.1060595 0.0034397 0.1079713 0.0316611 0.0058815 0.1117347 -0.0503966 0.0297454 -0.0490842 0.2763924 -0.0209357 0.0505463 -0.0389894 0.0572525 0.1896486 -0.0568225 0.0195264 -0.0396948 0.3349653 -0.1100196 0.0294528 -0.0981303 0.1140079 0.2169868 -0.0422896 0.0164456 -0.035232 0.3553442 -0.0670259 0.0219853 -0.0677989 0.1816736 unknown
polarizability: 105.7663334|3.1920884|82.8736627|-4.0839287|2.0438146|89.7562634 unknown
InChI: InChI=1S/C7H16N2O/c1-5(2)7(3,4)9-6(8)10/h5,9H,8H2,1-4H3
charge 0 multiplicity 1
26 atoms
O  -1.752236 -0.511959 -1.310741
N  -0.825684 0.383029 0.662186
N  -3.076058 -0.298698 0.591659
C  0.560401 0.643343 0.156153
C  1.228099 -0.721963 -0.273578
C  0.482247 1.627177 -1.043232
C  1.31251 1.323414 1.327521
C  2.63727 -0.546036 -0.889897
C  1.283514 -1.749865 0.882242
C  -1.860468 -0.157346 -0.09365
H  0.561133 -1.128821 -1.058245
H  -0.085432 2.529434 -0.751164
H  1.49135 1.944046 -1.358567
H  -0.032386 1.15342 -1.895238
H  2.354625 1.542144 1.042445
H  1.335022 0.684488 2.229941
H  0.828935 2.283689 1.587855
H  2.623859 0.088339 -1.792902
H  3.037623 -1.533156 -1.187466
H  3.353352 -0.108285 -0.16816
H  2.018949 -1.458665 1.656646
H  1.589803 -2.738689 0.494137
H  0.296709 -1.871419 1.364007
H  -0.989978 0.5721 1.65202
H  -3.242508 0.035355 1.538342
H  -3.847952 -0.696073 0.062789
