program: Gaussian 09
title: 000219609
version: EM64L-G09RevD.01
frameworkgroup: C1[X(C6H12O3)]
method: RPBEPBE
basis: SDD
operation: Freq
keyword: #pfreq=noraman
keyword: PBEPBE/SDD
title: #p freq=noraman PBEPBE/SDD
converged: YES YES NO NO
title: Mulliken charges:
elementType: O O O C C C C C C H H H H H H H H H H H H
charge: -0.272243 -0.261926 -0.197146 0.030414 -0.238870 -0.218468 -0.668700 -0.676981 -0.068959 0.188278 0.192601 0.227988 0.191761 0.228813 0.208634 0.234634 0.224928 0.207311 0.235081 0.229016 0.203833
chargesum: 0.00000
title: Mulliken charges with hydrogens summed into heavy atoms:
elementType: O O O C C C C C C
charge: -0.272243 -0.261926 -0.197146 0.218692 0.181719 0.202106 -0.000504 -0.005573 0.134874
polarizability: 9.12617434e+01 -1.89946298e+00 8.02237827e+01 -3.05793654e+00 -5.14167689e-01 6.20477136e+01
1716.lowfreq: -9.5790 -2.2238 -0.0011 -0.0009 -0.0002 4.1476 42.6409 53.6078 68.1970
frequency: 42.4656 53.5916 68.1594 80.4122 115.0384 161.7423 203.3951 230.0881 242.5125 266.6956 315.8638 407.3721 419.5249 439.6485 580.1663 806.0481 813.9651 815.8702 856.2771 910.3481 961.1085 1026.3316 1033.2553 1069.6865 1089.7505 1116.6732 1130.3001 1135.8224 1138.0514 1250.2405 1256.5989 1272.1117 1308.9340 1351.4828 1368.7460 1382.6674 1397.2467 1400.4079 1459.5746 1460.5701 1478.1327 1479.7584 1489.6730 1492.8079 1638.2416 2914.9998 2941.3625 2944.6445 2953.5989 2996.1215 2996.3676 3009.0421 3039.5340 3093.4901 3093.5976 3104.1911 3106.1773
redmass: 2.1913 3.4254 2.1155 2.6782 3.7998 2.5862 2.5940 1.2814 1.3176 2.7933 3.3259 7.2796 3.5918 3.4277 4.3589 2.2496 1.1265 1.2541 3.1425 4.2083 2.0127 2.8317 2.9441 3.4765 3.6416 2.2257 2.3871 1.4751 1.4931 1.1551 1.1414 1.3619 1.1085 1.2357 1.2879 1.2979 1.2642 1.3198 1.0405 1.0403 1.0513 1.0493 1.0787 1.0797 7.9698 1.0840 1.0865 1.0610 1.0629 1.0360 1.0361 1.1036 1.0996 1.0987 1.0990 1.1012 1.1015
irintensity: 0.0858 3.1079 2.6733 0.6448 7.1057 12.7613 3.0309 1.1814 2.9007 9.4224 11.7418 2.6819 19.8950 12.9049 4.3204 23.3368 1.4929 5.3196 20.7997 136.3340 66.6767 42.0562 97.8981 48.8341 82.6206 26.1447 14.1567 7.3258 4.5796 1.8982 0.9568 23.8232 29.9983 15.4578 5.5492 14.8171 17.4201 21.0808 12.4471 11.4403 4.8170 7.0322 7.5691 8.6875 111.7326 30.9378 46.6818 71.0179 79.4912 30.8999 13.4147 29.4387 20.1535 30.6916 31.7886 35.7899 36.7005
temp: 298.150 k
press: 1.00000 atm
elementType: 8 8 8 6 6 6 6 6 6 1 1 1 1 1 1 1 1 1 1 1 1
symmnumber: 1
zpe: 455839.9 jmol-1
zpe.correction: 0.173620 hartree
zpe.thermalcorrener: 0.185217 hartree
zpe.thermalcorrenthalpy: 0.186161 hartree
zpe.thermalcorrgfe: 0.134923 hartree
zpe.sumelectzpe: -460.714807 hartree
zpe.sumelectthermal: -460.703210 hartree
zpe.sumelectthermalent: -460.702265 hartree
zpe.sumelectthermalfe: -460.753504 hartree
dipole: 0.9855 -3.0175 1.3922
dipole: 3.4662
quadrupole: -50.9697 -60.8207 -53.8416
quadrupole: 4.0625 1.2571 -3.1350
quadrupole: 4.2410 -5.6100 1.3691 4.0625 1.2571 -3.1350
hfenergy: -460.8884268 hartree
pointgroup: C01 [X(C6H12O3)]
dipole: 0.205129 -1.3246865 0.2506412 debye
dipolederiv: -1.1758813 -0.1844255 -0.0022432 -0.3978653 -0.6987877 -0.0051436 -0.1408921 0.0004078 -0.3877511 -1.1952371 0.3096763 0.0071432 0.4671048 -0.7114602 -0.0523505 0.0818139 -0.0416661 -0.3891527 -0.4106989 0.3283952 0.1527135 0.1361508 -0.7295121 -0.0907885 0.1342615 -0.2148579 -0.4937341 1.4029559 -0.1642651 0.0270772 0.2145406 0.3013846 0.0501017 0.1257402 0.1673827 0.5167622 0.7699945 0.2304762 -0.0262686 0.1105072 0.3979947 -0.0854605 -0.2007878 -0.1529925 0.3136794 0.5413658 -0.2108815 0.0409649 -0.4499652 0.5943175 0.0187316 0.1465815 -0.0358065 0.3801606 -0.0665712 -0.0821748 -0.0617778 -0.0849821 0.0020478 -0.0424399 -0.0283285 -0.028718 0.0198017 -0.1052372 0.05335 0.0619412 0.0697776 0.0345907 -0.0108694 0.0513393 -0.0072265 0.0289669 0.2178008 -0.3092042 -0.2958762 -0.1753084 0.9921066 0.0049616 -0.2835673 0.0118852 0.569146 -0.0590497 0.0240127 0.0364342 -0.0355113 -0.0095739 0.0854664 0.001911 0.0146605 -0.1989592 -0.0533873 -0.0108768 -0.0996064 -0.0173337 -0.0100551 0.0926213 0.0098631 0.1192087 -0.1635405 -0.0583894 0.0109724 0.024792 0.0918784 -0.1054052 -0.0661814 0.0679366 -0.0164566 0.0389703 0.0182863 0.029751 0.0390094 0.0809486 -0.0083731 -0.0041307 -0.0200101 0.0762536 -0.2115963 -0.0343994 -0.1078174 -0.0384671 0.0003172 -0.092415 -0.0305679 -0.0538378 -0.0474923 0.0393582 -0.1194998 -0.0787397 0.0814263 -0.0714043 0.0814611 0.00513 0.1029212 0.0179091 0.0364628 0.1026673 0.0191238 -0.0325021 0.0278636 0.0337632 0.1058613 -0.0785087 0.0659647 -0.0778373 0.0528781 0.1278406 0.0290732 0.0748096 -0.0840589 -0.0564053 -0.011065 -0.0563459 0.0759117 0.0190203 0.0902878 0.0014144 0.1207547 -0.1127963 0.0398341 -0.0071535 0.049984 0.0973567 0.0840407 0.0041204 -0.0293549 -0.0264385 0.1105106 0.0415103 0.0175501 0.0183463 -0.1346318 -0.007425 -0.0807522 -0.0348325 -0.1442015 -0.0050808 -0.0609363 -0.0472498 -0.0778992 0.05482 0.0767665 0.0011308 0.1189394 0.0083573 0.0193417 0.0610557 0.1314821 0.1374589 -0.1141934 unknown
polarizability: 90.3698404|-2.6344661|80.0805268|-4.0438703|4.2007299|63.0828726 unknown
InChI: InChI=1S/C6H12O3/c1-3-8-6(5-7)9-4-2/h5-6H,3-4H2,1-2H3
charge 0 multiplicity 1
21 atoms
O  -0.938004 -0.308091 -0.296375
O  1.346076 0.258027 -0.018487
O  -1.059853 2.62894 0.947813
C  0.037496 0.490932 0.487989
C  -2.194932 -0.588228 0.440599
C  1.876978 -1.099465 0.27287
C  -3.063624 -1.455953 -0.467756
C  3.263611 -1.183841 -0.358521
C  -0.300883 1.954865 0.211428
H  -0.067869 0.233875 1.568932
H  -1.952004 -1.110726 1.391555
H  -2.702865 0.365453 0.689549
H  1.922601 -1.235165 1.375055
H  1.185346 -1.849464 -0.153967
H  -4.014416 -1.703054 0.038688
H  -3.295294 -0.923254 -1.40573
H  -2.546584 -2.397223 -0.722153
H  3.710733 -2.175919 -0.164895
H  3.198842 -1.036286 -1.449875
H  3.931736 -0.410779 0.058139
H  0.125408 2.343959 -0.743057
