program: Gaussian 09
title: 000219602
version: EM64L-G09RevD.01
frameworkgroup: C1[X(C6H11N)]
method: RPBEPBE
basis: SDD
operation: Freq
keyword: #pfreq=noraman
keyword: PBEPBE/SDD
title: #p freq=noraman PBEPBE/SDD
converged: YES YES NO NO
title: Mulliken charges:
elementType: N C C C C C C H H H H H H H H H H H
charge: -0.021648 0.278599 -0.442778 -0.703174 -0.702839 -0.703088 -0.167931 0.246573 0.246389 0.240966 0.213179 0.208211 0.240925 0.208126 0.213183 0.211629 0.211444 0.222234
chargesum: 0.00000
title: Mulliken charges with hydrogens summed into heavy atoms:
elementType: N C C C C C C
charge: -0.021648 0.278599 0.050184 -0.040818 -0.040604 -0.057782 -0.167931
polarizability: 8.04734287e+01 -5.30474409e+00 6.16067241e+01 -3.30871915e-02 1.21292372e-02 5.92536923e+01
1716.lowfreq: -9.1417 -0.0008 -0.0008 -0.0003 2.9315 13.7062 82.6298 141.0360 189.7769
frequency: 82.5247 141.0358 189.7292 250.6398 256.7790 298.4666 311.6909 378.3443 380.8722 394.1426 394.4581 541.8602 736.2382 876.9037 881.5757 930.7419 931.9439 946.8942 960.7285 1025.3089 1038.8957 1163.5719 1209.8732 1239.1847 1285.2772 1302.4442 1378.2633 1382.1377 1407.3020 1437.3945 1460.1655 1464.5552 1465.6679 1483.8939 1486.2269 1494.0777 2192.1971 2970.1037 2973.8085 2977.8876 2984.8697 3041.7894 3063.4319 3070.8418 3071.7157 3076.5186 3076.7553 3082.6828
redmass: 3.1089 4.9065 1.0476 1.0344 1.0461 2.7293 2.3266 3.1844 2.8642 2.5483 2.0656 4.0758 3.7582 1.7448 2.6010 1.6278 1.5848 1.2047 3.0535 1.4488 1.4211 1.3608 2.1823 2.7936 1.9415 1.6092 1.2000 1.2064 1.2059 1.0852 1.0481 1.0476 1.0465 1.0580 1.0562 1.0589 12.4335 1.0353 1.0352 1.0382 1.0560 1.1012 1.1002 1.0994 1.0994 1.0990 1.1001 1.0988
irintensity: 4.4744 3.6101 0.0971 0.0780 0.0179 0.0715 0.4271 0.2297 0.4025 0.3686 0.5273 0.9447 0.5379 0.7029 1.6587 3.1751 1.7119 0.0218 2.4086 0.2932 0.0011 1.8221 5.6009 29.0930 6.0334 7.0139 22.0450 27.5585 10.1001 5.7763 0.2800 1.0653 0.0085 12.2116 17.1956 24.0208 11.5650 30.9654 39.1708 12.0224 9.1409 4.7948 10.3528 47.1727 9.3740 55.6230 3.2458 75.1226
temp: 298.150 k
press: 1.00000 atm
elementType: 7 6 6 6 6 6 6 1 1 1 1 1 1 1 1 1 1 1
symmnumber: 1
zpe: 407881.2 jmol-1
zpe.correction: 0.155354 hartree
zpe.thermalcorrener: 0.164066 hartree
zpe.thermalcorrenthalpy: 0.165010 hartree
zpe.thermalcorrgfe: 0.122943 hartree
zpe.sumelectzpe: -289.413498 hartree
zpe.sumelectthermal: -289.404786 hartree
zpe.sumelectthermalent: -289.403842 hartree
zpe.sumelectthermalfe: -289.445909 hartree
dipole: 3.9527 -1.3425 -0.0086
dipole: 4.1745
quadrupole: -57.3192 -42.3657 -43.4276
quadrupole: 2.4131 0.0147 0.0065
quadrupole: -9.6150 5.3385 4.2766 2.4131 0.0147 0.0065
hfenergy: -289.568852 hartree
pointgroup: C01 [X(C6H11N1)]
dipole: -1.5515095 -0.5133298 -0.1634604 debye
dipolederiv: -0.3504316 0.0257593 0.0076502 -0.0597886 -0.2290627 0.0050867 -0.0187643 0.0053709 -0.2445699 0.2778111 -0.0516678 -0.0154098 -0.1497664 0.1393738 -0.0044463 -0.0455131 -0.0042277 0.1511564 -0.0689629 -0.0256377 -0.0088255 -0.0117041 0.0870296 -0.0277057 -0.0044363 -0.0278109 0.1680922 -0.005128 -0.0069012 -0.0151988 0.0141423 0.0214102 -0.0408271 -0.0132041 -0.048734 -0.064548 -0.0052257 -0.0145526 0.008706 0.0038019 -0.0473223 0.0529061 0.0188908 0.0605105 0.0040301 -0.0677492 -0.0450986 -0.0143076 0.0009924 0.0185461 -0.0118737 -0.0004692 -0.0115993 0.0528911 0.1662615 0.0566483 0.0180651 0.1730157 -0.0313976 0.003335 0.0539826 0.0029566 -0.0391933 0.0400445 -0.0197915 -0.0058111 -0.0119189 -0.0274129 0.0772823 -0.0147227 0.1177562 0.0382384 0.0399271 -0.0190819 -0.0058972 -0.017842 0.0841894 -0.0460489 0.0059248 -0.0866588 -0.0734803 -0.0632342 -0.1109714 -0.0598821 -0.1084674 0.0363034 -0.0351339 -0.0273686 -0.0151956 0.0672455 -0.0744187 0.1323174 0.0621316 0.1274942 0.0039811 -0.0490878 0.0220997 -0.0178444 0.0652744 0.0976714 -0.0083059 0.0088573 -0.0165269 -0.0823102 0.1545871 0.0028871 0.0919579 -0.0406505 -0.0633442 -0.1251277 -0.0136337 -0.1049652 0.0230861 0.004222 -0.0392383 -0.0159301 0.0805813 0.0977309 -0.0016591 -0.0102104 -0.0114546 0.0452972 -0.0966852 -0.0098545 -0.0338202 -0.1681986 -0.0745389 0.1445913 0.0217581 0.1178668 -0.0080729 0.0002913 0.0521835 -0.0308071 0.0776212 0.0776428 -0.0003562 -0.0164377 -0.0479534 -0.0896871 0.1173136 0.0171972 0.1458603 -0.0085518 0.0779848 -0.0082621 0.0159117 -0.0296729 0.0569125 -0.0739763 -0.0386186 -0.1021495 -0.15563 -0.1020406 0.0780973 0.0225339 0.132747 -0.0008634 -0.0292393 0.0390241 -0.0296349 0.0896918 unknown
polarizability: 80.4004759|5.1704732|61.4576244|1.6669793|0.6995612|59.4757449 unknown
InChI: InChI=1S/C6H11N/c1-6(2,3)4-5-7/h4H2,1-3H3
charge 0 multiplicity 1
18 atoms
N  2.719771 0.197879 0.077872
C  -0.874317 0.037153 0.015675
C  0.328669 -0.929073 -0.277413
C  -0.820073 0.511859 1.490113
C  -0.811888 1.2573 -0.938213
C  -2.179618 -0.762246 -0.234342
C  1.65199 -0.311548 -0.082936
H  0.258609 -1.816984 0.381218
H  0.264343 -1.291736 -1.322144
H  0.1114 1.069138 1.697498
H  -1.672717 1.180809 1.7082
H  -0.871992 -0.343539 2.189946
H  0.119646 1.833201 -0.790843
H  -0.856737 0.941008 -1.997479
H  -1.664804 1.934532 -0.749174
H  -2.249911 -1.640103 0.435559
H  -2.239183 -1.120705 -1.279537
H  -3.061589 -0.123247 -0.046501
