program: Gaussian 09
title: 000219594
version: EM64L-G09RevD.01
frameworkgroup: C1[X(C12H24O3)]
method: RPBEPBE
basis: SDD
operation: Freq
keyword: #pfreq=noraman
keyword: PBEPBE/SDD
title: #p freq=noraman PBEPBE/SDD
converged: YES YES NO NO
title: Mulliken charges:
elementType: O O O C C C C C C C C C C C C H H H H H H H H H H H H H H H H H H H H H H H H
charge: -0.483770 -0.401729 -0.255061 0.174124 -0.014661 -0.006372 -0.447884 -0.445483 -0.462901 -0.435916 0.036579 -0.723253 -0.708729 -0.720739 -0.718370 0.226345 0.221476 0.213481 0.241993 0.208345 0.209161 0.203470 0.239982 0.235504 0.209631 0.363317 0.216546 0.224773 0.209682 0.198831 0.214423 0.262383 0.219620 0.240971 0.217204 0.210811 0.216761 0.224379 0.385076
chargesum: 0.00000
title: Mulliken charges with hydrogens summed into heavy atoms:
elementType: O O O C C C C C C C C C C C C
charge: -0.120453 -0.016653 -0.255061 0.174124 0.211684 0.215104 0.007590 -0.027977 -0.019449 0.009219 0.036579 -0.072252 -0.033092 -0.042944 -0.066419
polarizability: 1.49637393e+02 1.19595752e+00 1.40999048e+02 4.31294910e-01 -1.27377606e+00 1.26216197e+02
1716.lowfreq: -18.1597 -6.7097 -0.0009 -0.0001 0.0007 9.5864 49.3702 64.5364 74.8767
frequency: 49.0946 64.2380 74.8204 91.3530 98.2919 115.8743 123.3618 134.6327 152.1779 175.6366 209.6363 223.1198 224.6213 227.5816 244.9972 273.1212 279.1515 302.5080 305.1099 322.3890 335.2566 359.2158 380.8890 407.7342 472.6085 496.2110 534.1853 550.9305 603.3835 639.1604 686.8358 698.9221 765.7152 770.8679 784.9147 794.2263 832.9009 855.8342 912.4930 914.5269 945.4427 977.1560 1003.0782 1011.9291 1015.6691 1026.7209 1032.1023 1053.5614 1060.5482 1064.5033 1098.3667 1126.5511 1145.5398 1149.8919 1159.3825 1175.7714 1237.8670 1249.2087 1268.6776 1274.1186 1275.7537 1284.2797 1291.8734 1316.1688 1320.2199 1345.2650 1350.4184 1353.9478 1355.5563 1376.3451 1389.6845 1392.7705 1394.8785 1395.9351 1464.1788 1469.6888 1474.8179 1474.9387 1477.9630 1479.5008 1483.0867 1485.4375 1492.0122 1493.9974 1495.1802 1502.8381 1611.2760 2972.4429 2973.6977 2974.8289 2976.0268 2977.0965 2983.2241 2984.7550 2992.6842 2996.3189 3006.9364 3025.0802 3039.7284 3043.1226 3048.8602 3067.2039 3069.5511 3069.9049 3071.5536 3078.7871 3079.0139 3086.1620 3103.1755 3449.3911 3502.5141
redmass: 3.3036 2.7946 6.5237 2.7049 2.5531 2.4432 2.3553 2.7418 2.4605 2.1281 1.2771 1.4404 1.3065 1.7651 3.1440 1.8699 2.5241 2.5985 2.4239 3.0191 2.5818 3.3270 3.2202 1.2696 2.9346 3.1857 2.2464 2.5852 1.7823 2.3854 2.4300 2.7522 1.7056 1.4774 1.4407 1.3905 1.8433 1.9253 1.8110 1.8221 3.2081 2.5049 1.8730 1.4588 1.8747 1.7419 1.9018 2.3818 2.1163 2.6325 1.8545 2.3347 2.1274 2.0471 2.4411 2.4861 1.3104 1.2934 1.4141 1.1795 1.2134 1.2455 1.3614 1.3992 1.3433 1.3871 1.4096 1.3667 1.4210 1.6340 1.2159 1.2170 1.2127 1.2047 1.0487 1.0561 1.0521 1.0507 1.0615 1.0460 1.0760 1.0486 1.0489 1.0430 1.0772 1.0732 8.3072 1.0607 1.0513 1.0595 1.0516 1.0624 1.0413 1.0365 1.0678 1.0679 1.0610 1.0978 1.0952 1.0970 1.0981 1.0989 1.0986 1.0985 1.0980 1.1003 1.0998 1.0995 1.0986 1.0650 1.0640
irintensity: 0.1589 0.0745 0.8314 0.4126 0.0728 0.3956 0.7156 0.3492 0.8749 0.9603 0.4698 0.5532 0.7751 1.9874 0.7769 1.4004 2.3000 33.4750 1.6631 4.8948 3.8538 24.0274 1.4083 61.4221 3.2604 7.7129 0.4614 8.4645 85.2833 56.3203 1.6929 56.9839 7.9679 6.9319 5.0483 16.9678 7.0857 6.8542 25.6703 4.5505 4.4568 97.6695 10.3837 10.5138 11.8169 2.3783 7.7534 50.2873 69.8211 40.5647 1.2095 12.3638 2.5248 1.7293 0.1347 3.8470 2.2788 1.4639 43.1152 3.6864 11.1679 13.1602 14.3875 2.0259 3.1678 7.9238 0.6374 3.9542 1.7227 6.6565 16.5689 22.2398 16.6792 13.5837 5.4104 6.4376 1.2647 11.5011 19.6878 3.7709 20.8810 6.0241 6.5560 1.6264 11.2109 12.5452 180.4949 36.2465 13.4911 39.3179 10.3892 28.7401 48.9842 32.4352 25.8853 35.6422 20.8355 35.9378 7.1663 3.9442 4.1488 35.4147 68.7879 32.6669 75.5023 40.0379 63.4951 46.0762 23.8639 44.2334 31.2325
temp: 298.150 k
press: 1.00000 atm
elementType: 8 8 8 6 6 6 6 6 6 6 6 6 6 6 6 1 1 1 1 1 1 1 1 1 1 1 1 1 1 1 1 1 1 1 1 1 1 1 1
symmnumber: 1
zpe: 899500.2 jmol-1
zpe.correction: 0.342602 hartree
zpe.thermalcorrener: 0.361435 hartree
zpe.thermalcorrenthalpy: 0.362380 hartree
zpe.thermalcorrgfe: 0.297259 hartree
zpe.sumelectzpe: -696.099060 hartree
zpe.sumelectthermal: -696.080226 hartree
zpe.sumelectthermalent: -696.079282 hartree
zpe.sumelectthermalfe: -696.144402 hartree
dipole: -0.4990 -0.0611 -2.2333
dipole: 2.2892
quadrupole: -93.1356 -94.3662 -95.7470
quadrupole: -0.0055 -0.1396 4.3426
quadrupole: 1.2807 0.0501 -1.3308 -0.0055 -0.1396 4.3426
hfenergy: -696.4416612 hartree
pointgroup: C01 [X(C12H24O3)]
dipole: -0.2171025 0.0418569 0.8730829 debye
polarizability: 149.6328896|-1.2054835|140.9554658|0.1438555|-1.5851094|126.2642819 unknown
InChI: InChI=1S/C12H24O3/c1-5-9(6-2)12(15,11(13)14)10(7-3)8-4/h9-10,13,15H,5-8H2,1-4H3
charge 0 multiplicity 1
39 atoms
O  0.465845 0.440701 -1.781039
O  -0.500195 1.764332 1.514579
O  -0.281599 2.713998 -0.58325
C  0.114414 0.287931 -0.35777
C  1.382435 -0.22685 0.434382
C  -1.12122 -0.698688 -0.300592
C  2.574375 0.750615 0.230501
C  1.764695 -1.703162 0.122195
C  -2.320763 -0.21348 -1.171989
C  -1.541177 -1.135684 1.128175
C  -0.242925 1.693716 0.151393
C  3.818587 0.399733 1.075203
C  2.303076 -1.994015 -1.297386
C  -3.283731 0.826822 -0.550994
C  -2.553784 -2.303622 1.117313
H  1.106773 -0.184639 1.50858
H  -0.731026 -1.598608 -0.81995
H  2.253231 1.778346 0.49733
H  2.840478 0.779263 -0.841911
H  2.529429 -2.005821 0.86498
H  0.89547 -2.359212 0.319918
H  -2.913679 -1.107698 -1.44635
H  -1.911259 0.176408 -2.122117
H  -1.964055 -0.278109 1.681641
H  -0.648457 -1.452439 1.698738
H  0.363718 1.404131 -2.01786
H  4.589883 1.18578 0.977748
H  4.275902 -0.553538 0.7553
H  3.563044 0.30967 2.148461
H  2.521893 -3.072797 -1.408153
H  3.239464 -1.442114 -1.498443
H  1.577382 -1.695109 -2.070922
H  -3.734899 0.462539 0.389965
H  -2.790632 1.792222 -0.342915
H  -4.110413 1.034478 -1.255511
H  -2.151424 -3.175271 0.566062
H  -2.782795 -2.633761 2.147287
H  -3.507544 -2.016563 0.638922
H  -0.715417 2.705697 1.75978
