program: Gaussian 09
title: 000219592
version: EM64L-G09RevD.01
frameworkgroup: C1[X(C14H10O6)]
method: RPBEPBE
basis: SDD
operation: Freq
keyword: #pfreq=noraman
keyword: PBEPBE/SDD
title: #p freq=noraman PBEPBE/SDD
converged: YES YES NO NO
title: Mulliken charges:
elementType: O O O O O O C C C C C C C C C C C C C C H H H H H H H H H H
charge: -0.398792 -0.375292 -0.320385 -0.183154 -0.415959 -0.413703 0.181979 0.247937 0.063116 0.028281 0.176334 0.190877 -0.289510 -0.245341 -0.535913 -0.581256 -0.388791 -0.404896 0.338937 0.332206 0.270708 0.260491 0.253950 0.217934 0.258907 0.261502 0.384625 0.358853 0.364790 0.361566
chargesum: 0.00000
title: Mulliken charges with hydrogens summed into heavy atoms:
elementType: O O O O O O C C C C C C C C C C C C C C
charge: -0.014167 -0.016440 -0.320385 -0.183154 -0.051169 -0.052137 0.181979 0.247937 0.063116 0.028281 0.176334 0.190877 -0.018802 0.015150 -0.281963 -0.363322 -0.129884 -0.143395 0.338937 0.332206
polarizability: 3.09840289e+02 -7.46550917e+00 1.67979856e+02 -6.76117967e+00 1.50694390e+00 1.06950994e+02
1716.lowfreq: -5.4307 0.0004 0.0006 0.0007 4.1028 8.1154 17.6262 25.9088 47.9091
frequency: 17.1515 25.7905 47.8833 85.0627 103.5929 133.2793 164.0315 205.3789 209.6755 223.4765 262.2670 274.2957 306.2383 328.1694 335.8330 370.3613 382.9427 391.9908 404.0738 425.7723 434.0936 446.6401 450.5962 474.1852 501.5356 529.3545 552.0615 603.9328 609.3527 622.9289 633.6794 676.7896 692.3995 727.8454 729.5399 744.2138 768.3125 799.2976 809.6384 820.1540 839.5194 844.5250 950.9124 954.4783 957.1363 961.1568 963.4603 1005.3636 1097.4781 1127.3369 1135.4364 1137.6397 1160.5143 1184.1901 1202.6802 1219.8039 1240.4546 1291.1646 1302.2024 1320.6862 1323.0972 1367.3106 1406.0669 1410.2504 1415.4607 1422.6106 1490.9841 1514.6965 1542.3191 1546.5852 1580.9325 1597.0097 1621.7858 1644.4172 2725.1954 3103.5688 3150.1739 3171.2030 3174.0325 3190.8843 3192.9235 3541.4171 3573.1583 3577.5223
redmass: 7.1714 6.5738 5.6927 6.5301 7.1834 8.5723 9.5078 6.4030 6.7339 6.4288 6.1578 5.5252 7.4480 4.9742 5.6021 7.3406 1.1347 10.9019 1.8141 2.1185 1.1951 2.8210 3.0055 4.3922 4.9003 9.7757 6.6855 6.8337 7.0043 4.8495 4.6024 4.3031 3.2701 5.4125 7.2228 3.3534 3.0766 2.2360 1.8717 1.6828 1.7949 3.7973 1.2568 1.9707 1.4415 1.4700 3.6059 7.3355 1.9775 1.5839 1.5421 1.5648 1.2066 1.5321 1.4750 2.3286 2.5988 1.9858 2.5011 2.2194 2.5628 4.4990 4.5006 3.2705 5.0974 4.2267 3.4241 2.8884 3.4540 8.1039 4.3578 6.6932 6.5443 4.9007 1.0721 1.0912 1.0924 1.0882 1.0882 1.0978 1.0973 1.0658 1.0660 1.0661
irintensity: 4.5040 1.0744 0.8179 0.3856 0.0372 1.4387 0.1775 1.1366 0.6263 1.8426 4.2105 10.0652 27.7481 7.6374 12.7476 1.4752 163.3738 1.2359 43.3258 70.1235 126.9555 9.8090 25.7052 6.7575 19.7512 60.1636 2.6561 113.8242 3.9833 6.6807 2.7149 30.5315 16.6493 1.8731 4.9111 0.0242 25.1425 45.8622 29.5280 70.4885 72.6028 29.7786 91.7243 34.7493 16.0968 12.2750 39.8698 7.6676 221.7632 92.8129 421.4689 268.7046 100.2722 19.2686 7.2102 72.6831 333.7075 39.7719 14.8933 12.1115 85.7272 207.1795 53.7043 96.1441 51.3514 47.4782 121.5945 11.5790 32.1233 256.8148 145.2581 110.1241 373.7169 451.6482 317.0221 17.3055 5.8313 0.0846 0.6306 3.7310 2.5891 27.4447 81.6431 68.3722
temp: 298.150 k
press: 1.00000 atm
elementType: 8 8 8 8 8 8 6 6 6 6 6 6 6 6 6 6 6 6 6 6 1 1 1 1 1 1 1 1 1 1
symmnumber: 1
zpe: 553294.2 jmol-1
zpe.correction: 0.210739 hartree
zpe.thermalcorrener: 0.228075 hartree
zpe.thermalcorrenthalpy: 0.229019 hartree
zpe.thermalcorrgfe: 0.164321 hartree
zpe.sumelectzpe: -989.409387 hartree
zpe.sumelectthermal: -989.392051 hartree
zpe.sumelectthermalent: -989.391107 hartree
zpe.sumelectthermalfe: -989.455805 hartree
dipole: 3.5744 0.8769 2.7526
dipole: 4.5959
quadrupole: -61.4419 -119.0855 -122.6555
quadrupole: 17.9679 -2.3731 -0.6520
quadrupole: 39.6191 -18.0245 -21.5945 17.9679 -2.3731 -0.6520
hfenergy: -989.6201256 hartree
pointgroup: C01 [X(C14H10O6)]
dipole: -1.4192649 1.0836622 0.2842345 debye
polarizability: 308.5056914|5.3693465|106.8428925|15.9830807|0.4707467|169.4225547 unknown
InChI: InChI=1S/C14H10O6/c15-7-1-3-9(11(17)5-7)13(19)14(20)10-4-2-8(16)6-12(10)18/h1-6,15-18H
charge 0 multiplicity 1
30 atoms
O  2.843628 -1.002843 -2.008663
O  -3.106146 -0.771768 2.149439
O  0.410055 -1.280254 -1.413474
O  -0.408898 -0.958529 1.8668
O  5.696982 1.458636 1.038544
O  -5.508707 1.504518 -1.464267
C  1.89206 -0.125326 0.084643
C  -1.906929 -0.075887 0.149897
C  0.586823 -0.647938 -0.290814
C  -0.613557 -0.562365 0.678709
C  3.000476 -0.317005 -0.830376
C  -3.127463 -0.158883 0.899873
C  2.135261 0.599795 1.29604
C  -1.977179 0.542878 -1.136862
C  4.27773 0.206042 -0.528798
C  -4.336545 0.359805 0.377962
C  3.394685 1.118557 1.594372
C  -3.163193 1.067449 -1.662037
C  4.464636 0.915163 0.673646
C  -4.35019 0.971326 -0.895636
H  1.315331 0.72915 2.006663
H  -1.06794 0.601829 -1.739274
H  5.090942 0.041371 -1.244183
H  -5.261626 0.283998 0.967236
H  3.589661 1.669239 2.517641
H  -3.199953 1.539259 -2.646606
H  1.849278 -1.298883 -2.057105
H  -4.014186 -0.793322 2.547726
H  6.390467 1.271274 0.357067
H  -6.293903 1.395513 -0.871663
