program: Gaussian 09
title: 000219591
version: EM64L-G09RevD.01
frameworkgroup: C1[X(C11H14N4O4)]
method: RPBEPBE
basis: SDD
operation: Freq
keyword: #p
keyword: freq=noraman
keyword: PBEPBE/SDD
title: #p freq=noraman PBEPBE/SDD
converged: YES YES NO NO
title: Mulliken charges:
elementType: O O O O N N N N C C C C C C C C C C C H H H H H H H H H H H H H H
charge: -0.188203 -0.272053 -0.212610 -0.207330 -0.433245 -0.022942 0.023088 0.015730 0.204498 -0.488319 -0.514563 0.303983 0.259574 -0.671084 -0.658184 -0.297451 -0.498124 0.445538 -0.368394 0.239548 0.211400 0.232508 0.232581 0.367721 0.232265 0.212460 0.234431 0.227913 0.222802 0.238099 0.300657 0.335392 0.292316
chargesum: 0.00000
title: Mulliken charges with hydrogens summed into heavy atoms:
elementType: O O O O N N N N C C C C C C C C C C C
charge: -0.188203 -0.272053 -0.212610 -0.207330 -0.065524 -0.022942 0.023088 0.015730 0.204498 -0.037371 -0.049474 0.303983 0.259574 0.008072 0.030630 0.003206 -0.162731 0.445538 -0.076078
polarizability: 3.43937658e+02 -1.86881105e+00 1.99957748e+02 -7.16154044e-01 -8.56697394e+00 8.67724315e+01
1716.lowfreq: -7.2040 -1.3820 -0.0010 -0.0007 -0.0006 4.4709 28.6999 39.4543 54.7154
frequency: 28.6263 39.4141 54.7115 61.0397 67.8339 78.1188 90.2599 126.3251 157.8057 163.5387 177.2361 191.0568 213.4170 224.9235 253.0209 288.0361 308.4370 324.6659 365.3315 390.7332 401.9803 440.9229 452.9752 505.4702 515.3543 536.8099 606.7983 642.3371 652.4136 662.8886 676.1428 706.0242 725.4251 751.8047 759.4245 784.5094 802.6039 814.6381 852.3351 863.5028 888.3326 944.1855 963.3655 986.9863 1011.8485 1018.2519 1033.5731 1041.0897 1051.9672 1073.7014 1098.9613 1118.7219 1136.2028 1166.1814 1210.9203 1222.9755 1231.8387 1249.5260 1267.5191 1299.2726 1309.7198 1319.8590 1341.3477 1360.5234 1385.1181 1390.9554 1398.0165 1448.6891 1457.6108 1468.4193 1475.6123 1477.2107 1482.9972 1484.0710 1501.0871 1517.3469 1576.3701 1585.6506 1624.1281 2980.8902 2983.4503 2987.2468 2992.2687 3053.1573 3062.7660 3087.1620 3091.5712 3094.4636 3095.3449 3180.0961 3189.1628 3201.4907 3240.5306
redmass: 4.0099 4.4722 5.5712 9.2315 2.8692 8.8541 3.1213 3.6594 5.5833 5.3392 2.4007 1.2231 1.7768 3.8698 2.3952 3.6999 6.2867 6.2954 6.8246 4.1660 5.9187 3.7008 4.7630 8.4427 3.5963 3.9439 5.4659 6.4461 7.8933 4.1467 7.4542 7.8198 4.8651 7.7550 2.8268 1.2064 1.5203 1.2483 2.9709 1.4213 6.4898 1.9569 1.4062 2.9202 1.3156 3.1391 1.6416 1.9408 2.0940 1.7340 3.7074 1.9174 1.3614 8.8293 3.8235 1.8609 1.8367 1.2205 1.4989 1.9213 1.4138 1.9803 4.0918 6.7396 2.4066 1.4143 1.3041 5.3331 1.0996 1.8532 1.0514 1.0444 1.1436 1.0805 1.5040 2.6063 4.9124 6.9834 7.3598 1.0638 1.0652 1.0360 1.0350 1.0962 1.0970 1.0991 1.1011 1.1013 1.1004 1.0896 1.0919 1.0961 1.0787
irintensity: 0.3228 0.6259 0.1733 0.3186 0.2892 1.3781 0.1642 2.1318 1.8521 2.6199 2.3242 0.4308 1.3778 2.0078 3.4749 2.8251 0.2038 2.4171 0.0840 0.7072 2.0782 0.0852 2.1025 6.3289 12.8400 26.3951 1.2072 3.3988 16.2194 1.3466 9.5125 7.9442 1.2953 10.8783 0.4298 1.3998 25.4108 78.5993 1.5190 23.6765 6.8165 5.3293 24.0663 21.0652 0.1124 33.2051 5.6491 32.5382 28.5323 10.7598 65.1392 14.9922 44.3366 367.5776 393.2674 32.4071 141.7668 4.8445 10.3889 97.4703 0.5967 45.3772 200.0142 66.3471 17.9694 6.4474 23.0369 1.2041 14.7826 14.7153 3.7287 14.7460 3.6863 13.6248 75.8757 92.3254 49.9190 115.4863 436.7868 25.3943 14.3825 45.6893 26.1687 11.6483 0.6634 49.4524 17.1875 18.1156 69.0361 3.1168 19.6522 0.0396 65.2064
temp: 298.150 k
press: 1.00000 atm
elementType: 8 8 8 8 7 7 7 7 6 6 6 6 6 6 6 6 6 6 6 1 1 1 1 1 1 1 1 1 1 1 1 1 1
symmnumber: 1
zpe: 655665.1 jmol-1
zpe.correction: 0.249730 hartree
zpe.thermalcorrener: 0.268394 hartree
zpe.thermalcorrenthalpy: 0.269338 hartree
zpe.thermalcorrgfe: 0.201187 hartree
zpe.sumelectzpe: -945.878047 hartree
zpe.sumelectthermal: -945.859382 hartree
zpe.sumelectthermalent: -945.858438 hartree
zpe.sumelectthermalfe: -945.926589 hartree
dipole: -9.2750 -2.1131 0.3712
dipole: 9.5199
quadrupole: -124.2411 -123.5379 -110.5233
quadrupole: 4.1380 -0.4563 2.2875
quadrupole: -4.8070 -4.1038 8.9108 4.1380 -0.4563 2.2875
hfenergy: -946.1277763 hartree
pointgroup: C01 [X(C11H14N4O4)]
dipole: -3.6361017 -0.8979113 0.0267133 debye
polarizability: 342.9050172|3.3628002|195.5909709|16.1381362|-23.2555448|92.1718489 unknown
InChI: InChI=1S/C11H14N4O4/c1-3-8(4-2)12-13-10-6-5-9(14(16)17)7-11(10)15(18)19/h5-7,13H,3-4H2,1-2H3
charge 0 multiplicity 1
33 atoms
O  1.622874 3.182291 -0.800497
O  -0.569096 2.564769 -0.755501
O  4.703992 -2.054542 0.779856
O  5.172522 0.113777 0.228135
N  -1.224532 0.119931 -0.153052
N  -2.133586 -0.918371 0.079436
N  0.71304 2.291502 -0.613873
N  4.346135 -0.857689 0.438911
C  -3.415206 -0.644543 -0.096944
C  -4.375861 -1.78919 0.155242
C  -3.985486 0.708758 -0.501607
C  0.122524 -0.109706 -0.011119
C  1.098713 0.935759 -0.231966
C  -4.985128 -2.356939 -1.156247
C  -4.103427 1.682522 0.708083
C  0.611501 -1.405782 0.365649
C  2.481056 0.686258 -0.083987
C  2.905102 -0.5948 0.283782
C  1.973153 -1.648672 0.511298
H  -3.839548 -2.590339 0.692484
H  -5.196272 -1.432528 0.810444
H  -4.988966 0.55315 -0.934961
H  -3.375772 1.181955 -1.297392
H  -1.484381 1.087356 -0.430545
H  -5.695026 -3.170634 -0.925091
H  -5.533087 -1.583256 -1.724392
H  -4.193332 -2.765217 -1.808289
H  -3.118721 1.905874 1.155051
H  -4.745807 1.254739 1.498181
H  -4.549639 2.638329 0.383189
H  -0.129776 -2.189114 0.531933
H  3.202149 1.489363 -0.255905
H  2.349883 -2.63411 0.797292
