program: Gaussian 09
title: 000219589
version: EM64L-G09RevD.01
frameworkgroup: C1[X(C12H8Br2O2S)]
method: RPBEPBE
basis: SDD
operation: Freq
keyword: #p
keyword: freq=noraman
keyword: PBEPBE/SDD
title: #p freq=noraman PBEPBE/SDD
converged: YES YES NO NO
title: Mulliken charges:
elementType: Br Br S O O C C C C C C C C C C C C H H H H H H H H
charge: 0.019933 0.019933 0.155939 -0.404823 -0.404821 -0.307867 -0.307869 0.315903 0.315899 -0.149152 -0.149146 -0.307876 -0.307875 -0.232122 -0.232125 -0.152635 -0.152635 0.260736 0.260736 0.265431 0.265431 0.256401 0.256400 0.358102 0.358102
chargesum: 0.00000
title: Mulliken charges with hydrogens summed into heavy atoms:
elementType: Br Br S O O C C C C C C C C C C C C
charge: 0.019933 0.019933 0.155939 -0.046720 -0.046720 -0.307867 -0.307869 0.315903 0.315899 0.111583 0.111590 -0.042445 -0.042444 -0.232122 -0.232125 0.103766 0.103765
polarizability: 2.24567737e+02 -1.20899756e+01 1.96805031e+02 1.37388079e-02 -2.07326545e-02 1.37314545e+02
1716.lowfreq: -3.8352 -0.0019 -0.0010 0.0009 0.4668 3.2861 11.5273 14.7498 33.2030
frequency: 11.5222 14.6526 33.2030 110.2298 110.9883 117.7889 132.8411 178.0510 188.5105 234.4137 265.0860 273.6183 302.6345 314.2657 324.4879 373.9153 377.6774 433.6757 467.7142 475.3087 482.6619 536.5353 550.0225 554.8388 564.4104 602.5120 603.7626 671.9304 677.3924 702.9063 714.8380 812.2019 813.6613 824.8172 824.8475 867.0848 870.0240 956.9808 957.2176 1011.6698 1026.0138 1063.0750 1064.2771 1125.9648 1133.2163 1168.2230 1179.1513 1231.5166 1231.8437 1286.6156 1294.5658 1378.0268 1378.9583 1390.5682 1392.2503 1443.2217 1448.6020 1570.5387 1572.8658 1593.5476 1594.7913 3165.0580 3165.1021 3167.9221 3167.9814 3184.5995 3184.6207 3424.1102 3428.9577
redmass: 20.0513 9.4796 7.5463 8.0667 7.2903 11.3829 5.4810 10.4911 5.8116 6.7354 13.9306 14.4584 8.4763 7.3933 6.9007 6.5921 9.3071 3.2466 3.4346 4.3231 4.9702 3.2187 1.2663 1.1412 2.7718 8.4535 8.4404 8.1135 7.8195 3.8423 3.9976 6.8162 6.8325 1.4543 1.4536 1.4164 1.4348 1.3490 1.3506 5.8323 5.4149 2.2195 2.1646 1.4592 1.4070 1.3614 1.4959 1.9671 1.8290 1.5400 1.6237 6.3418 5.8746 3.2377 3.1213 2.7891 2.8368 6.8306 6.7435 6.9049 6.9731 1.0888 1.0888 1.0931 1.0931 1.0976 1.0976 1.0643 1.0645
irintensity: 0.0080 0.1725 0.0041 0.4337 0.1538 0.0045 0.1003 2.7523 0.2798 2.8567 2.1049 1.9139 16.5725 0.2144 0.0012 0.6741 6.3729 9.2993 28.0632 5.6500 14.7612 29.1600 117.3523 108.1701 23.7930 53.0655 14.8436 30.5322 11.6354 0.3541 4.9845 5.6157 0.0000 44.8012 31.2095 12.6626 13.2248 0.3561 0.3226 32.9469 1.9475 9.5653 4.0164 26.8542 10.6485 374.5082 97.2937 16.4646 5.1478 29.2712 0.0249 23.1557 18.1039 2.8331 3.1245 282.1084 83.0548 8.7391 3.5648 1.0454 0.9248 1.2194 1.1450 0.0245 0.1964 4.9874 0.4826 127.6825 36.0804
temp: 298.150 k
press: 1.00000 atm
elementType: 35 35 16 8 8 6 6 6 6 6 6 6 6 6 6 6 6 1 1 1 1 1 1 1 1
symmnumber: 1
zpe: 435423.3 jmol-1
zpe.correction: 0.165844 hartree
zpe.thermalcorrener: 0.182024 hartree
zpe.thermalcorrenthalpy: 0.182969 hartree
zpe.thermalcorrgfe: 0.117599 hartree
zpe.sumelectzpe: -1036.294426 hartree
zpe.sumelectthermal: -1036.278245 hartree
zpe.sumelectthermalent: -1036.277301 hartree
zpe.sumelectthermalfe: -1036.342671 hartree
dipole: 0.0001 0.0001 0.8728
dipole: 0.8728
quadrupole: -128.6943 -122.9922 -123.7117
quadrupole: 6.4481 -0.0002 -0.0003
quadrupole: -3.5616 2.1406 1.4210 6.4481 -0.0002 -0.0003
hfenergy: -1036.4602696 hartree
pointgroup: C01 [X(C12H8Br2O2S1)]
dipole: 0.0000455 -0.000007 -0.3434033 debye
dipolederiv: -0.1276672 -0.1240264 -0.0897528 -0.2355616 -0.4881522 -0.261617 -0.1616997 -0.2573392 -0.1851142 -0.127977 -0.1246723 0.0895252 -0.2355999 -0.4883258 0.2616243 0.161862 0.2576892 -0.1849562 -0.0946703 0.0036152 -0.0000648 0.2732388 -0.2082784 0.0000468 -0.0000464 0.0000025 0.1445094 -0.4095077 -0.2485198 -0.0444936 -0.2373617 -0.9843744 -0.5006759 -0.0536821 -0.4433508 -0.5772116 -0.4094572 -0.2485029 0.0449031 -0.2373185 -0.9841825 0.5006766 0.0538068 0.4435477 -0.5775851 0.2535166 0.1027546 0.3017075 -0.1653148 -0.1744453 -0.111928 0.2186948 0.0519232 -0.1496955 0.2536638 0.1027102 -0.3016774 -0.1652466 -0.174341 0.1118323 -0.218597 -0.0518294 -0.1497467 -0.0000104 0.2909619 0.0898992 0.1060684 0.8124646 0.4753933 -0.0144646 0.4853657 0.3483494 -0.0002075 0.2908781 -0.0899069 0.1059541 0.8121475 -0.4754133 0.01435 -0.4855412 0.3483926 -0.0859988 -0.1285581 -0.0441896 0.0642917 -0.2012504 -0.0519328 -0.0437136 -0.1430094 -0.0896636 -0.0861733 -0.1286901 0.0444158 0.0642758 -0.2011305 0.0520416 0.0438879 0.1431981 -0.0898615 -0.0479629 -0.2227152 -0.0224046 0.0393784 -0.0680019 0.0062247 0.0953203 -0.1510902 -0.1593877 -0.0481855 -0.2234356 0.0222874 0.0391175 -0.0682088 -0.0061495 -0.0950363 0.1515844 -0.1593278 -0.0817299 0.2932181 0.1674549 0.429647 0.7845962 0.5047137 0.195074 0.5606785 0.166887 -0.0816654 0.2933943 -0.1673793 0.4302413 0.7855272 -0.5047962 -0.1952238 -0.5608964 0.1668872 0.0084638 -0.1046814 0.0578844 -0.2042659 -0.0989773 -0.0827348 -0.0059057 -0.0911155 -0.054936 0.0085703 -0.1051064 -0.0584113 -0.2040354 -0.0985162 0.0829353 0.0058313 0.0913171 -0.0546088 0.0962504 0.0918159 -0.0382656 0.0742661 0.0512195 -0.0025425 -0.0193536 0.0174171 0.1112544 0.0963565 0.0919989 0.0383159 0.0741909 0.0511285 0.0024766 0.0192413 -0.0175601 0.1112183 0.0665146 0.0481681 -0.0474852 0.0649879 -0.0031859 -0.0148368 -0.0667828 -0.0221126 0.1274798 0.0667037 0.0486877 0.0476416 0.0646169 -0.0040878 0.0145933 0.0667433 0.0220324 0.1274346 0.0278165 0.0046512 -0.0910079 -0.0004317 0.1136462 -0.0145782 -0.1011529 -0.0118113 0.0787126 0.0281012 0.0057277 0.0913132 -0.0005191 0.1135123 0.0145664 0.1008685 0.0109975 0.0784987 0.3476338 -0.0048726 -0.0883137 -0.0723241 0.3606139 0.1245474 -0.0518149 0.0742006 0.3110958 0.3476219 -0.0048011 0.0880045 -0.0722953 0.3606023 -0.1244674 0.0517931 -0.0742981 0.3113748 unknown
polarizability: 206.6545419|17.9611724|214.718226|-0.0011856|-0.0248434|137.3145449 unknown
InChI: InChI=1S/C12H8Br2O2S/c13-7-1-3-9(15)11(5-7)17-12-6-8(14)2-4-10(12)16/h1-6,15-16H
charge 0 multiplicity 1
25 atoms
Br 3.339339 2.915091 1.691648
Br -3.339554 -2.914931 1.691474
S  0.000123 -0.000071 -1.999599
O  1.910411 -2.306416 -1.273292
O  -1.910358 2.306286 -1.273845
C  1.431453 0.077532 -0.815561
C  -1.431387 -0.077593 -0.815771
C  2.199234 -1.104806 -0.62946
C  -2.199236 1.104739 -0.629922
C  1.763526 1.269403 -0.135546
C  -1.76352 -1.269398 -0.135669
C  3.306408 -1.081745 0.252159
C  -3.306547 1.081739 0.251528
C  2.86743 1.266559 0.738685
C  -2.867559 -1.266493 0.738392
C  3.641686 0.101138 0.938435
C  -3.641888 -0.101077 0.937888
H  1.170799 2.176189 -0.283322
H  -1.170737 -2.17618 -0.283248
H  3.888124 -1.997452 0.387769
H  -3.888316 1.997441 0.386945
H  4.496897 0.11437 1.619664
H  -4.497204 -0.114262 1.618986
H  1.134367 -2.175761 -1.887424
H  -1.13419 2.175599 -1.887814
