program: Gaussian 09
title: 000219585
version: EM64L-G09RevD.01
frameworkgroup: C1[X(C6H11NO4)]
method: RPBEPBE
basis: SDD
operation: Freq
keyword: #p
keyword: freq=noraman
keyword: PBEPBE/SDD
title: #p freq=noraman PBEPBE/SDD
converged: YES YES NO NO
title: Mulliken charges:
elementType: O O O O N C C C C C C H H H H H H H H H H H
charge: -0.424378 -0.417248 -0.232784 -0.244692 -0.084385 -0.330416 -0.447368 -0.452233 -0.669182 0.243597 0.222805 0.206008 0.198646 0.232867 0.232615 0.259752 0.255557 0.254357 0.240777 0.199451 0.379997 0.376258
chargesum: 0.00000
title: Mulliken charges with hydrogens summed into heavy atoms:
elementType: O O O O N C C C C C C
charge: -0.044381 -0.040990 -0.232784 -0.244692 -0.084385 0.074239 0.018114 0.063076 0.025402 0.243597 0.222805
polarizability: 9.33176425e+01 5.50947041e+00 8.10963489e+01 5.78434828e+00 -2.91407347e+00 7.72282844e+01
1716.lowfreq: -13.9474 -9.3382 -0.0005 0.0006 0.0009 9.1542 30.2895 51.1637 65.0052
frequency: 29.2125 50.6921 64.9126 88.2876 101.4703 117.7927 170.8557 233.1287 241.8312 295.9810 371.4010 410.9445 422.3846 459.8565 471.2101 516.3148 586.1682 597.8151 632.9510 688.0853 784.8549 793.2704 806.9980 827.1155 932.6112 948.5853 988.7301 1025.1242 1068.5498 1086.0103 1105.8408 1171.9912 1212.8977 1251.1007 1255.7322 1292.3493 1333.7458 1348.5491 1356.8084 1365.9855 1378.7380 1393.1178 1413.1968 1431.8485 1458.8999 1467.9460 1495.3630 1664.5088 1676.0121 2947.1095 2966.5740 2980.5149 2985.4189 3019.2226 3034.2607 3074.1651 3080.0792 3108.9291 3508.8057 3511.3396
redmass: 9.1214 6.4278 2.5541 3.5191 5.9176 4.7230 6.0416 1.2101 3.7545 3.4704 2.5314 3.3582 2.2264 2.2082 2.0967 3.8505 1.9788 2.2199 1.4099 3.5898 1.4025 2.3284 3.9328 6.2246 2.1627 2.7970 2.4639 2.7992 2.3691 1.8737 1.8189 1.8924 1.4748 1.6913 1.3596 1.8728 1.3971 1.3883 1.2826 1.4385 1.7713 1.2048 1.1139 1.0908 1.0800 1.0469 1.0552 8.3219 8.4370 1.0636 1.0617 1.0626 1.0377 1.0983 1.0981 1.1000 1.0979 1.1007 1.0642 1.0640
irintensity: 0.1080 0.1425 0.1568 0.4490 2.9704 3.8247 3.1146 0.1009 2.8649 1.5032 10.1683 6.6946 18.7395 10.2200 18.1651 32.9149 131.3732 89.1907 75.6828 54.4576 21.8170 4.9022 3.9721 21.7216 24.7285 8.9965 42.1672 325.5286 146.3406 80.1729 13.4902 11.0553 16.6018 19.5670 3.5778 10.1387 19.0681 9.6629 10.5029 9.5893 25.9868 33.6813 30.7093 23.1692 7.2417 9.4717 12.8155 153.9273 264.2264 70.2281 31.9107 50.9673 33.9627 28.0541 9.2418 17.1590 31.5387 17.1946 12.2560 24.0754
temp: 298.150 k
press: 1.00000 atm
elementType: 8 8 8 8 7 6 6 6 6 6 6 1 1 1 1 1 1 1 1 1 1 1
symmnumber: 1
zpe: 455204.2 jmol-1
zpe.correction: 0.173378 hartree
zpe.thermalcorrener: 0.185902 hartree
zpe.thermalcorrenthalpy: 0.186846 hartree
zpe.thermalcorrgfe: 0.133297 hartree
zpe.sumelectzpe: -589.996610 hartree
zpe.sumelectthermal: -589.984086 hartree
zpe.sumelectthermalent: -589.983142 hartree
zpe.sumelectthermalfe: -590.036691 hartree
dipole: -2.0424 0.3100 -1.6768
dipole: 2.6607
quadrupole: -65.8769 -59.0690 -67.7254
quadrupole: 3.4359 -7.1172 -1.9363
quadrupole: -1.6531 5.1547 -3.5016 3.4359 -7.1172 -1.9363
hfenergy: -590.169988 hartree
pointgroup: C01 [X(C6H11N1O4)]
dipole: 0.5872613 -0.5147452 0.6971056 debye
dipolederiv: -0.4494357 0.1096163 0.0234458 0.0433984 -1.1808306 -0.0748441 0.0238385 -0.2010039 -0.2553942 -0.8021559 0.4764583 -0.1112369 0.4845134 -1.0182966 0.1262253 -0.0241785 0.0413263 -0.2445051 -0.5156478 0.2148544 -0.1753355 0.1615869 -0.69062 0.0236903 -0.4200947 0.2139152 -0.6706756 -0.481939 0.2029539 0.0278738 0.2287336 -0.6028776 0.0269721 -0.1321013 0.2895799 -0.8527703 -0.609295 -0.0297476 0.0268932 0.1046467 -0.7036541 -0.0055684 -0.0516831 0.0357161 -0.6655806 0.1815803 0.1358697 -0.028763 0.1500792 0.7365645 -0.0200424 -0.0777394 -0.0757061 0.3613565 0.5007157 0.113584 -0.0958427 0.113641 0.096058 -0.0359487 -0.0088324 -0.0083431 0.2665961 0.4257092 -0.3048923 -0.0099298 -0.3621183 0.4053828 0.0300722 0.0276865 0.0062395 0.0629864 0.0283852 0.0170683 -0.0084205 0.0041335 -0.0755174 0.0416881 0.0100603 0.1098402 -0.167436 0.3988045 -0.3800025 0.320362 -0.3062376 1.4357447 0.0623216 0.4874998 0.0324564 0.764554 0.7346898 -0.6674956 0.0316188 -0.6799594 1.0598746 -0.1316821 0.1352265 -0.3254761 0.9800025 0.013108 0.1209082 0.118923 0.0348458 -0.1232106 -0.0859095 0.0828619 -0.0819654 -0.0777212 -0.1665251 -0.0443713 -0.1002924 0.0025342 0.0447397 0.0367214 -0.0724954 0.0312633 0.0268887 0.011901 0.06792 0.0045921 0.1172229 -0.0406038 -0.082082 -0.0295349 -0.0400402 0.0694608 0.0398796 -0.0473821 -0.0106852 -0.1335718 -0.0393488 0.1346937 0.034825 0.0842597 -0.0254349 0.0752244 -0.0509899 0.0863327 0.0018223 -0.0684417 0.0602713 0.0542793 0.0353895 0.0666258 -0.1180128 0.0226509 -0.0825689 -0.0235712 0.0896648 -0.0712632 -0.0507032 -0.0430177 0.0548222 0.0414453 0.0587887 0.0550384 0.0557102 0.0934554 -0.0850981 0.053745 -0.0546686 -0.0021446 -0.0908077 0.0333148 -0.0602886 0.0046482 0.1337998 -0.0005462 -0.0230605 0.0118331 0.0521863 0.0584875 -0.117107 0.0085639 -0.1021345 -0.2062011 0.0444781 0.0035655 0.0240344 0.0750634 0.3732518 0.0330584 -0.054836 0.057073 0.3208799 0.0214368 -0.095402 -0.0265875 0.1034377 0.3506369 0.0349425 0.0345556 0.0430032 0.3334379 -0.0155862 0.0722371 -0.0590449 0.077682 unknown
polarizability: 81.4884866|-8.7100622|90.717761|5.554889|-0.0525639|79.4360281 unknown
InChI: InChI=1S/C6H11NO4/c1-2-7(3-5(8)9)4-6(10)11/h8,10H,2-4H2,1H3
charge 0 multiplicity 1
22 atoms
O  -1.615192 -1.394296 -0.489563
O  2.28649 -2.026249 0.057536
O  -2.484867 0.651523 -1.175293
O  1.22119 -0.496814 -1.327678
N  0.006004 0.728907 1.136688
C  0.462051 2.108402 0.865559
C  -1.424912 0.431148 1.08161
C  0.950959 -0.365573 1.173059
C  0.311484 2.618921 -0.588716
C  -1.919355 -0.035649 -0.299104
C  1.451488 -0.920716 -0.1777
H  -0.089622 2.791673 1.545872
H  1.5274 2.158911 1.164781
H  -1.989977 1.343697 1.339038
H  -1.674738 -0.359923 1.815646
H  0.518396 -1.226058 1.719435
H  1.860902 -0.069908 1.735058
H  0.847707 1.96321 -1.294061
H  -0.749386 2.645895 -0.893746
H  0.718032 3.645346 -0.667825
H  -1.826913 -1.65391 -1.427217
H  2.623756 -2.377841 -0.81078
