program: Gaussian 09
title: 000219576
version: EM64L-G09RevD.01
frameworkgroup: C1[X(C7H12N4O2)]
method: RPBEPBE
basis: SDD
operation: Freq
keyword: #p
keyword: freq=noraman
keyword: PBEPBE/SDD
title: #p freq=noraman PBEPBE/SDD
converged: YES YES NO NO
title: Mulliken charges:
elementType: O O N N N N C C C C C C C H H H H H H H H H H H H
charge: -0.323635 -0.278216 -0.438165 -0.429227 -0.600676 -0.008939 -0.135041 -0.668656 -0.071362 0.317053 0.201721 -0.659838 -0.166705 0.266110 0.337861 0.277667 0.193786 0.228115 0.294634 0.301204 0.233074 0.242061 0.216324 0.326701 0.344149
chargesum: 0.00000
title: Mulliken charges with hydrogens summed into heavy atoms:
elementType: O O N N N N C C C C C C C
charge: -0.323635 -0.278216 -0.100304 -0.128024 0.070174 -0.008939 0.131069 0.030911 0.223272 0.317053 0.201721 0.031621 -0.166705
polarizability: 1.44795158e+02 -2.03574525e+00 9.05839074e+01 1.01325440e+01 -5.47993738e+00 8.92009756e+01
1716.lowfreq: -9.1783 -4.6824 -0.0008 -0.0008 -0.0007 4.8075 26.6365 33.5225 51.3563
frequency: 26.2448 33.3325 51.3499 75.6919 93.7094 106.7513 167.5053 191.5392 216.9619 223.7444 235.9928 292.0862 300.5965 329.9677 361.6162 388.7394 430.4799 506.6981 518.6165 546.1281 564.6022 578.8363 602.4226 627.0989 699.8251 708.8349 717.9538 805.9293 828.2591 912.9356 916.3860 1015.6380 1040.2424 1066.1840 1072.0357 1091.5557 1098.4962 1145.4556 1198.6771 1214.3084 1260.4115 1299.2262 1313.4217 1323.7049 1364.9059 1388.8948 1395.1344 1441.6897 1465.1047 1469.6201 1475.8202 1483.4944 1497.8888 1592.1729 1617.5803 1647.6955 2185.8494 2985.4987 2990.0752 2995.1611 3001.6263 3087.9212 3097.5916 3110.3678 3112.5596 3449.7979 3523.0407 3556.8998 3674.7012
redmass: 4.7828 4.9780 4.9749 5.5320 7.0729 4.5278 4.0321 5.1600 1.5634 1.1126 1.8143 3.4559 3.5879 6.2795 1.8538 3.3303 1.7431 3.1234 1.2418 3.8447 2.4192 2.6793 2.2202 1.2812 4.2252 5.2512 5.8032 2.4938 2.5287 2.1169 2.1807 3.6815 1.5665 2.0276 1.7959 2.5213 2.5728 2.4518 2.4324 1.5595 1.6051 1.2744 1.3108 1.3735 1.9248 1.2005 1.5157 1.3837 1.1483 1.0819 1.1234 1.0587 2.6584 1.7583 3.8702 2.9839 12.5529 1.0827 1.0366 1.0406 1.0760 1.0986 1.1007 1.1014 1.1018 1.0776 1.0450 1.0779 1.1044
irintensity: 2.1756 0.6444 8.3364 6.6289 15.9435 3.0581 1.2128 37.8344 0.3867 2.0253 1.2134 9.3136 1.5523 6.3376 11.1372 1.8486 26.1042 33.8625 62.8963 7.2698 123.9292 35.4961 30.2439 198.2950 53.1442 21.9055 1.8235 8.6491 3.6042 5.2753 6.2723 8.0666 13.2150 6.6726 10.8782 5.8408 15.4812 130.1116 68.1628 21.4726 2.5314 24.3002 11.5838 29.2237 152.3337 19.7111 68.6274 53.5746 71.2729 19.1756 4.0618 35.5538 762.1846 132.5928 184.3535 205.3251 6.0189 20.5152 33.5440 23.3783 20.8885 35.9667 24.5253 18.6475 8.2790 139.3057 44.3871 18.1459 32.5603
temp: 298.150 k
press: 1.00000 atm
elementType: 8 8 7 7 7 7 6 6 6 6 6 6 6 1 1 1 1 1 1 1 1 1 1 1 1
symmnumber: 1
zpe: 519246.8 jmol-1
zpe.correction: 0.197771 hartree
zpe.thermalcorrener: 0.212573 hartree
zpe.thermalcorrenthalpy: 0.213517 hartree
zpe.thermalcorrgfe: 0.154391 hartree
zpe.sumelectzpe: -642.421909 hartree
zpe.sumelectthermal: -642.407107 hartree
zpe.sumelectthermalent: -642.406162 hartree
zpe.sumelectthermalfe: -642.465289 hartree
dipole: -5.3277 -1.6722 -2.3574
dipole: 6.0612
quadrupole: -66.3283 -81.0742 -84.4051
quadrupole: -15.9894 -3.3028 0.6607
quadrupole: 10.9409 -3.8050 -7.1359 -15.9894 -3.3028 0.6607
hfenergy: -642.6196793 hartree
pointgroup: C01 [X(C7H12N4O2)]
dipole: -2.1047914 0.6738766 -0.8957321 debye
dipolederiv: -0.8798675 -0.0044583 0.0329265 -0.0667654 -0.8605888 -0.2366194 0.0537063 -0.2501513 -0.5015519 -0.8187968 0.0230201 -0.04548 0.2339631 -0.7690691 -0.3070202 0.0861821 -0.2866986 -0.5597831 -1.5756548 -0.1399719 0.0882644 -0.5984519 -0.4906056 0.0275892 -0.1553995 0.0088639 -0.5020952 -1.5106887 0.2320846 0.2266179 0.3132543 -0.4358483 0.0685861 0.3337411 0.0862618 -0.5947828 -1.1763615 0.3043743 0.1036627 0.2079864 -0.485073 0.1713435 0.0138843 0.1872955 -0.544531 -0.2837331 0.0255122 -0.0450998 0.1121327 -0.2529872 0.0327922 -0.0830154 0.0048578 -0.2348211 0.5128734 -0.0932419 -0.2112228 -0.3421334 0.1326561 -0.1871016 -0.3399277 -0.1564405 0.2218553 -0.1111144 -0.076369 -0.0313401 -0.0240452 0.053245 -0.008985 0.0615534 -0.0032227 -0.0690022 0.862119 0.0336261 -0.0148022 0.3923925 0.2082651 -0.1180036 0.1745292 -0.1282816 0.3764351 2.5142392 -0.0278778 -0.2727234 0.042402 1.1006725 0.4026933 -0.2981787 0.4333571 0.5226253 1.5161484 -0.2953877 0.0911334 -0.3525256 0.8512041 0.4719927 0.0337793 0.4073203 0.4863746 -0.1019013 0.0369421 -0.0139397 -0.0254507 0.0744318 0.0683833 0.0247544 0.0662696 -0.004748 -0.0896286 -0.1169724 0.1139819 -0.1584496 0.0095694 -0.0320661 0.0786417 -0.0262092 -0.071214 0.0051401 0.0084499 -0.0025133 0.1132003 -0.0609317 0.0637895 0.0254894 0.0490565 0.0213708 0.3443063 0.0117879 0.05303 0.2028661 0.2263112 -0.0477032 0.1493076 -0.0539215 0.2776574 0.0459328 -0.0596381 -0.0963898 -0.0490651 0.0667717 -0.0417615 -0.1121602 -0.0298594 0.0478903 -0.1509597 0.1093518 0.0849588 0.1305413 0.0435562 -0.0251732 0.0826371 0.0074725 0.0498328 0.11054 0.0082852 0.0127752 -0.0198807 -0.1017472 0.0885644 0.0053585 0.0197588 0.0465994 0.2217223 0.0274189 -0.0125913 -0.0899413 0.0858832 -0.0121633 -0.0842853 -0.0045148 0.0412935 0.1029099 -0.0101442 0.021726 -0.0270903 0.1501994 -0.0989758 -0.0103764 -0.1047457 0.3044934 -0.1265494 -0.085476 -0.0017415 -0.1040947 0.073019 -0.0105264 -0.0161709 -0.0354988 0.0688671 0.0431542 0.0867141 -0.0632594 0.0818391 0.0122563 0.0766607 -0.0570057 0.0804404 0.0019173 0.1020868 -0.0058347 0.0188429 0.0237801 -0.0780408 -0.124039 0.036962 -0.0531061 0.0103029 0.2458375 0.0008373 -0.0112311 -0.0147113 0.2154212 -0.1189629 0.0029729 -0.1189026 0.2954046 0.1982458 0.0069675 -0.0255852 0.0182474 0.2314295 -0.1032938 -0.0069797 -0.0994014 0.3096095 unknown
polarizability: 145.1542341|-9.3362095|91.8086472|0.9821576|4.9988012|87.6171599 unknown
InChI: InChI=1S/C7H12N4O2/c1-4(3-8)10-7(13)11-5(2)6(9)12/h4-5,10-11H,9H2,1-2H3
charge 0 multiplicity 1
25 atoms
O  0.328092 1.617761 0.658262
O  -3.03356 -1.404798 -1.180021
N  -0.936178 -0.176016 -0.142778
N  1.39673 -0.169293 -0.417734
N  -4.585731 0.125952 -0.386698
N  4.274406 -1.173086 1.269967
C  -2.212408 0.408662 0.271893
C  -2.423598 0.32961 1.808866
C  2.725187 0.424134 -0.227232
C  0.256323 0.488014 0.071332
C  -3.306163 -0.368449 -0.498301
C  3.433423 0.758294 -1.565324
C  3.5817 -0.456923 0.612859
H  -2.235292 1.476028 -0.027533
H  -1.023301 -1.03834 -0.695775
H  -1.582645 0.841977 2.303718
H  -3.361311 0.827153 2.118546
H  -2.454846 -0.721559 2.143358
H  2.536716 1.360263 0.335942
H  1.325948 -1.085594 -0.862301
H  4.416404 1.224497 -1.378469
H  2.806141 1.462805 -2.136438
H  3.591823 -0.151194 -2.171106
H  -4.799218 0.958061 0.15999
H  -5.342942 -0.36556 -0.861029
