program: Gaussian 09
title: 000219573
version: EM64L-G09RevD.01
frameworkgroup: C1[X(C5H7Br3O)]
method: RPBEPBE
basis: SDD
operation: Freq
keyword: #p
keyword: freq=noraman
keyword: PBEPBE/SDD
title: #p freq=noraman PBEPBE/SDD
converged: YES YES NO NO
title: Mulliken charges:
elementType: Br Br Br O C C C C C H H H H H H H
charge: 0.003409 0.131636 0.089077 -0.122299 -0.230947 -0.636642 -0.637566 0.385456 -0.832949 0.254088 0.247668 0.243619 0.239500 0.268145 0.236529 0.361277
chargesum: 0.00000
title: Mulliken charges with hydrogens summed into heavy atoms:
elementType: Br Br Br O C C C C C
charge: 0.003409 0.131636 0.089077 -0.122299 -0.230947 0.108732 0.106608 0.385456 -0.471672
polarizability: 1.14606249e+02 7.90622740e+00 1.24435821e+02 3.11739507e+00 2.93034521e+00 8.20357996e+01
1716.lowfreq: -6.9850 -1.7639 -0.0004 -0.0002 -0.0001 7.9554 36.8639 38.4661 96.1315
frequency: 36.8108 38.4138 96.1308 130.5856 148.3764 178.4777 206.8516 221.6557 242.5728 259.1709 275.6102 329.3600 381.2123 430.2355 534.1803 592.5750 652.2951 727.4051 767.3762 899.0489 938.5504 991.2535 1026.6660 1097.1353 1138.5979 1199.7584 1205.1280 1250.9279 1386.0597 1401.9023 1442.5268 1454.1366 1463.1927 1476.2717 1618.6976 2988.1837 2997.1015 3085.1947 3094.5838 3113.2265 3130.5920 3135.2124
redmass: 20.9995 6.1892 20.5718 19.9156 11.8198 5.0045 3.8769 1.1397 3.0447 1.2863 2.7788 3.5824 4.2415 3.1853 8.7379 4.2273 5.5889 6.6613 5.9149 2.8478 1.3969 1.4075 2.1264 1.6662 1.1058 2.2476 2.1321 2.3430 1.1897 1.1814 1.0480 1.0486 1.0559 1.0509 11.1287 1.0384 1.0387 1.0961 1.0957 1.1004 1.1010 1.0882
irintensity: 0.5401 1.6515 0.6320 1.9770 0.5891 0.6085 0.4184 0.1808 0.0989 0.9205 5.5737 9.2624 9.0599 18.0944 71.9246 20.9583 25.2225 38.2224 8.8652 4.0921 0.3779 22.2986 72.0255 52.7846 28.7625 6.1550 18.4751 14.5517 26.2112 18.0854 5.5948 7.5354 11.6149 22.6145 90.6005 5.1640 9.7450 5.9957 11.8411 17.9432 8.0112 0.6424
temp: 298.150 k
press: 1.00000 atm
elementType: 35 35 35 8 6 6 6 6 6 1 1 1 1 1 1 1
symmnumber: 1
zpe: 285807.3 jmol-1
zpe.correction: 0.108858 hartree
zpe.thermalcorrener: 0.120563 hartree
zpe.thermalcorrenthalpy: 0.121507 hartree
zpe.thermalcorrgfe: 0.067761 hartree
zpe.sumelectzpe: -309.610119 hartree
zpe.sumelectthermal: -309.598414 hartree
zpe.sumelectthermalent: -309.597470 hartree
zpe.sumelectthermalfe: -309.651216 hartree
dipole: -1.9018 2.4682 -1.5801
dipole: 3.4936
quadrupole: -82.7413 -77.0825 -85.9995
quadrupole: -4.9628 -2.8521 0.5562
quadrupole: -0.8002 4.8586 -4.0584 -4.9628 -2.8521 0.5562
hfenergy: -309.7189771 hartree
pointgroup: C01 [X(C5H7Br3O1)]
dipole: -0.9536553 0.5999209 -0.7873279 debye
dipolederiv: -0.3043318 -0.1099866 -0.0605484 -0.0624729 -0.5570877 -0.1658307 -0.0496084 -0.1800411 -0.2317755 -0.2820025 0.3078686 -0.0886269 0.2279369 -0.3701965 0.1299728 -0.0803193 0.1651566 -0.059899 -0.1990862 -0.2071645 0.1164441 -0.0968463 -0.6081037 0.1864323 0.070781 0.1511019 -0.1138765 -0.5431363 -0.0667856 -0.0753683 0.0559214 -0.179733 -0.0621536 0.045546 -0.1194309 -0.7683185 0.0179037 -0.0476809 -0.1376316 -0.0210501 0.861386 0.1725646 -0.0175495 0.1739572 0.1978642 -0.0446326 -0.0228529 -0.005342 -0.0085924 -0.1390628 0.067941 0.000492 -0.0095381 -0.0654395 -0.1102888 -0.0227988 0.0622568 0.0454357 -0.1171512 -0.0779363 0.0396678 -0.0313722 -0.0961205 1.0924277 0.302281 0.1500361 0.0183201 -0.1569544 0.1141274 -0.2869994 0.1669572 0.8156284 0.2009472 -0.1398861 0.1503386 -0.1483731 1.1687572 -0.3407836 0.2478404 -0.3635897 0.0616819 -0.0935129 0.0072936 -0.0813656 -0.0166381 0.111626 -0.001276 -0.0490665 0.0242107 0.0801563 0.0176455 0.0230357 0.1184952 0.0287778 0.0684255 -0.0383883 0.1309318 0.004578 -0.0040399 0.1176602 -0.0344727 -0.0105651 -0.0215288 -0.0815863 -0.0419429 -0.0085004 -0.0284202 0.053315 -0.0888642 0.0089968 -0.0451617 -0.0078532 0.1132731 -0.0029682 -0.0848495 -0.0081398 0.0558128 0.1170218 0.0330949 -0.0218895 0.0016788 0.0332776 0.0912981 0.0083588 0.0737433 0.0045972 0.0895564 -0.0213129 0.0150069 -0.0200777 -0.0736836 -0.0586384 0.0225066 -0.0723977 0.0641038 0.0126927 -0.0096296 -0.0860787 0.0253619 -0.0731861 0.0275817 0.0107685 0.0532249 0.0063097 unknown
polarizability: 110.6182788|4.1511646|128.1478865|3.487268|-3.006479|82.3117049 unknown
InChI: InChI=1S/C5H7Br3O/c1-5(2,8)3(9)4(6)7/h4H,1-2H3
charge 0 multiplicity 1
16 atoms
Br -1.571253 -1.82957 -0.803193
Br 2.615001 -1.488062 0.203328
Br 2.147897 1.639183 -0.827938
O  0.336389 0.182025 1.73455
C  -1.294286 0.118252 -0.084873
C  -1.44646 1.069073 -1.282749
C  -2.343147 0.353373 1.004215
C  0.13701 0.049935 0.507284
C  1.294544 -0.170738 -0.489625
H  -2.469252 0.990572 -1.687772
H  -0.735836 0.861429 -2.098406
H  -1.28377 2.109779 -0.942321
H  -3.357095 0.27771 0.57834
H  -2.238744 -0.367179 1.829287
H  -2.206494 1.367669 1.424696
H  0.971697 -0.535153 -1.472824
