program: Gaussian 09
title: 000219570
version: EM64L-G09RevD.01
frameworkgroup: C1[X(C14H20N4O4)]
method: RPBEPBE
basis: SDD
operation: Freq
keyword: #p
keyword: freq=noraman
keyword: PBEPBE/SDD
title: #p freq=noraman PBEPBE/SDD
converged: YES YES NO NO
title: Mulliken charges:
elementType: O O O O N N N N C C C C C C C C C C C C C C H H H H H H H H H H H H H H H H H H H H
charge: -0.188529 -0.272623 -0.212488 -0.207234 -0.019688 -0.437271 0.023171 0.015760 -0.360040 -0.383165 -0.339948 -0.522740 -0.357010 0.178291 -0.692753 -0.801914 0.302235 0.260359 -0.297139 -0.498247 0.445458 -0.368418 0.194145 0.203348 0.198731 0.216853 0.186575 0.184406 0.233412 0.220000 0.196707 0.195842 0.209691 0.209874 0.218729 0.252494 0.253562 0.253824 0.377178 0.300698 0.335552 0.292311
chargesum: 0.00000
title: Mulliken charges with hydrogens summed into heavy atoms:
elementType: O O O O N N N N C C C C C C C C C C C C C C
charge: -0.188529 -0.272623 -0.212488 -0.207234 -0.019688 -0.060093 0.023171 0.015760 0.037454 0.032419 0.031033 -0.069328 0.035538 0.178291 -0.054459 -0.042033 0.302235 0.260359 0.003559 -0.162694 0.445458 -0.076108
polarizability: 3.48301050e+02 5.81440086e+01 2.19339910e+02 4.08771984e+01 -3.15075465e+01 1.63366508e+02
1716.lowfreq: -16.1009 -5.3687 -2.9017 0.0006 0.0008 0.0010 8.9580 16.7755 23.8803
frequency: -7.2504 15.9700 22.4850 48.5422 52.9976 62.1837 67.5430 78.3448 98.2423 113.9726 118.1345 138.8444 143.7241 158.1875 164.4200 218.0408 228.3920 233.6552 256.0011 267.0683 315.2576 320.5530 349.7326 363.3620 387.2001 400.9680 436.7222 442.8293 486.3347 505.0613 515.1415 531.6585 574.1900 610.4807 644.9743 652.3611 674.8541 706.2267 719.4062 725.5832 741.2693 753.0316 779.1084 815.3359 831.0179 853.5827 861.1772 864.0782 889.0988 890.7938 945.0351 963.6264 983.3533 989.8882 1009.6695 1011.8952 1022.7936 1040.5798 1053.2234 1072.3476 1077.6703 1100.0120 1108.9654 1117.2673 1136.6913 1165.7981 1190.2421 1200.8958 1211.9025 1232.4120 1247.7553 1257.4758 1268.6829 1283.1142 1288.4389 1301.9224 1309.7462 1321.7003 1339.7615 1348.8032 1355.3181 1360.8968 1385.9763 1388.7173 1390.5531 1447.8328 1451.3532 1458.9031 1459.6708 1463.2118 1468.5905 1475.9119 1478.8114 1480.7027 1483.8575 1487.4364 1517.0963 1574.1596 1586.1305 1623.9083 2952.0987 2961.2710 2967.0362 2967.9234 2971.3260 2972.5625 2978.4572 2989.9678 3007.4417 3024.3272 3039.4990 3042.0262 3063.6803 3068.6675 3072.7966 3109.9763 3179.6581 3189.1224 3201.0495 3236.8684
redmass: 2.4556 4.8383 2.4866 6.7536 3.6791 9.7284 5.1214 6.5664 2.5060 2.3584 2.3955 1.4210 3.1257 9.3634 5.1678 3.5929 3.9870 1.1214 3.0406 4.6665 4.6290 6.4456 3.7343 5.2934 5.1458 4.8233 3.1221 3.8487 4.0443 7.7243 3.5598 4.1511 2.6371 5.5370 5.8156 7.8961 8.9509 7.8075 1.0989 4.8324 1.3085 12.0886 2.3241 1.1824 1.6239 3.4156 1.6856 1.4249 2.2594 4.0157 1.3842 1.4055 1.8802 1.9445 2.2762 1.3238 2.3665 2.1843 2.0774 2.2918 2.2974 3.8453 1.9021 2.1033 1.3611 8.8003 1.5230 1.4048 4.7445 1.8977 1.4881 1.2749 2.1306 1.0534 1.1588 2.0288 1.3806 1.5180 3.4546 1.6288 1.8940 4.7035 4.1735 1.2105 1.2170 4.1579 1.1742 1.2333 1.1588 1.0900 1.0716 1.0658 1.0503 1.1748 1.7945 1.0905 3.3900 5.7565 5.9500 7.3068 1.0589 1.0594 1.0577 1.0426 1.0593 1.0371 1.0630 1.0975 1.1001 1.1032 1.0979 1.1031 1.0976 1.1007 1.0992 1.0959 1.0896 1.0919 1.0961 1.0787
irintensity: 0.0808 0.6081 0.2802 0.4932 0.5378 0.3403 0.4251 0.7838 1.7447 0.4937 0.1041 0.7196 4.2433 2.2654 2.7529 5.9976 0.6525 0.0980 2.1918 0.2315 0.1324 1.2167 1.0712 0.1833 0.5327 0.7979 0.5005 0.7913 2.9415 6.9665 12.9568 17.2944 9.1826 1.5575 2.3929 16.2679 10.2660 7.9244 10.0790 1.2805 0.4430 10.7111 0.5973 92.8697 3.9131 5.7337 3.6033 24.7000 2.8824 5.0533 3.0616 24.2322 15.2290 0.2008 5.1907 0.1458 8.2413 3.3357 29.8243 10.3178 1.1617 62.4728 9.4394 35.5477 46.2663 361.4513 3.1277 1.9863 426.1571 140.9820 8.3285 5.5411 22.4743 1.1719 0.3172 83.4547 11.6902 20.3754 215.4197 12.3624 18.6993 50.3688 28.8373 38.9478 11.8629 3.9552 23.9214 9.2091 7.8278 1.9294 1.6981 15.6773 14.4152 4.6552 72.5369 31.8166 84.9803 31.8426 127.3250 427.5059 7.6625 0.5160 2.8194 11.3326 98.3588 30.0434 87.3356 1.3572 1.8116 3.7095 17.5953 82.4004 24.6786 97.3138 45.3132 20.6603 3.1359 19.8824 0.0330 67.1115
temp: 298.150 k
press: 1.00000 atm
elementType: 8 8 8 8 7 7 7 7 6 6 6 6 6 6 6 6 6 6 6 6 6 6 1 1 1 1 1 1 1 1 1 1 1 1 1 1 1 1 1 1 1 1
symmnumber: 1
zpe: 873660.3 jmol-1
zpe.correction: 0.332760 hartree
zpe.thermalcorrener: 0.354766 hartree
zpe.thermalcorrenthalpy: 0.355710 hartree
zpe.thermalcorrgfe: 0.278864 hartree
zpe.sumelectzpe: -1063.548960 hartree
zpe.sumelectthermal: -1063.526954 hartree
zpe.sumelectthermalent: -1063.526010 hartree
zpe.sumelectthermalfe: -1063.602856 hartree
dipole: -8.9484 -1.7424 -2.6610
dipole: 9.4969
quadrupole: -160.0502 -140.3249 -133.7477
quadrupole: -4.1008 -2.6132 8.1182
quadrupole: -15.3426 4.3827 10.9599 -4.1008 -2.6132 8.1182
hfenergy: -1063.8817195 hartree
pointgroup: C01 [X(C14H20N4O4)]
dipole: -3.6176518 -0.571018 -0.7395406 debye
polarizability: 359.1578371|50.4777132|202.6362325|19.5048129|-42.7503409|169.2133992 unknown
InChI: InChI=1S/C14H20N4O4/c1-3-4-5-6-7-11(2)15-16-13-9-8-12(17(19)20)10-14(13)18(21)22/h8-10,16H,3-7H2,1-2H3
charge 0 multiplicity 1
42 atoms
O  3.388031 -2.287432 2.10677
O  1.207554 -2.675114 1.573748
O  5.026479 2.502216 -1.605556
O  5.965297 1.173112 -0.000039
N  -1.057077 -0.847246 -1.036539
N  0.02963 -1.229843 -0.241634
N  2.334628 -2.008836 1.421828
N  4.972569 1.537409 -0.743654
C  -4.227898 0.778425 -0.198673
C  -4.543812 -0.560015 -0.90187
C  -5.424235 1.328804 0.610151
C  -3.351247 -1.124125 -1.730468
C  -5.120999 2.676497 1.304341
C  -2.171561 -1.541679 -0.879907
C  -6.318079 3.217417 2.115549
C  -2.329598 -2.706447 0.082278
C  1.227156 -0.565995 -0.358677
C  2.376534 -0.924531 0.443891
C  1.379046 0.515665 -1.289989
C  3.601297 -0.233314 0.314095
C  3.69635 0.814362 -0.607683
C  2.586175 1.19527 -1.415758
H  -3.920948 1.525896 -0.959158
H  -3.35621 0.652074 0.475377
H  -4.867952 -1.307718 -0.149014
H  -5.402299 -0.421199 -1.588669
H  -6.298933 1.45344 -0.062293
H  -5.725781 0.583587 1.37625
H  -3.010462 -0.363462 -2.455491
H  -3.702593 -2.006121 -2.304579
H  -4.824416 3.421679 0.538305
H  -4.244506 2.55324 1.972781
H  -6.612816 2.506509 2.910597
H  -7.198839 3.375671 1.464737
H  -6.077385 4.182321 2.598124
H  -1.584614 -3.502401 -0.116599
H  -3.330891 -3.154514 -0.005722
H  -2.193689 -2.392102 1.136423
H  0.012806 -1.997885 0.459235
H  0.508815 0.780499 -1.892804
H  4.457601 -0.519897 0.929815
H  2.706072 2.019786 -2.123317
