program: Gaussian 09
title: 000219553
version: EM64L-G09RevD.01
frameworkgroup: C1[X(C12H8Br2S2)]
method: RPBEPBE
basis: SDD
operation: Freq
keyword: #p
keyword: freq=noraman
keyword: PBEPBE/SDD
title: #p freq=noraman PBEPBE/SDD
converged: YES YES NO NO
title: Mulliken charges:
elementType: Br Br S S C C C C C C C C C C C C H H H H H H H H
charge: 0.028393 0.028376 0.068832 0.068760 -0.241751 -0.241761 -0.180450 -0.182019 -0.183067 -0.182004 -0.175307 -0.168468 -0.168378 -0.175254 -0.200578 -0.200629 0.270493 0.265692 0.265757 0.270527 0.258946 0.257482 0.257507 0.258900
chargesum: 0.00000
title: Mulliken charges with hydrogens summed into heavy atoms:
elementType: Br Br S S C C C C C C C C C C C C
charge: 0.028393 0.028376 0.068832 0.068760 -0.241751 -0.241761 0.090043 0.083673 0.082690 0.088524 0.083639 0.089014 0.089128 0.083646 -0.200578 -0.200629
polarizability: 3.10360784e+02 3.51037654e-01 2.28277756e+02 1.62879618e+01 -2.31415253e-01 1.10978571e+02
1716.lowfreq: -6.1883 -3.9016 -0.0018 -0.0018 -0.0017 4.2803 9.1108 22.5231 28.1612
frequency: 9.0554 22.4823 28.1341 45.0224 51.7153 95.2055 134.1732 178.8415 188.8785 239.8943 244.8645 274.3987 306.4499 314.7729 318.0739 372.3109 406.1815 406.7903 460.5743 461.7436 497.6184 498.6832 616.4446 616.5652 700.6321 701.0716 705.7632 706.9770 829.0276 830.9895 832.2159 833.4546 961.1055 961.7281 973.9449 974.4207 986.0042 987.1834 1049.4788 1051.2096 1066.0956 1070.5720 1099.8631 1100.5712 1181.4542 1182.8602 1282.4667 1282.9445 1352.2537 1352.5984 1376.9331 1377.8885 1446.4141 1447.8574 1561.1580 1562.5969 1563.7925 1564.0592 3154.5267 3154.8152 3155.9818 3156.0202 3174.2345 3174.4410 3178.1874 3178.3536
redmass: 21.5970 3.9442 4.2543 12.0495 9.6868 8.7411 11.0485 11.2674 10.9355 14.8797 21.3514 9.1053 5.6163 6.4039 5.1359 16.9206 2.8766 2.8823 8.8636 8.3642 3.2789 3.2689 7.1422 7.1452 4.6267 4.6145 5.7736 5.9113 1.2415 1.3132 1.4499 1.3590 1.3272 1.3288 1.3771 1.3753 6.3200 6.3629 6.7155 5.1406 1.9503 2.1368 1.3972 1.3950 1.1171 1.1164 1.2389 1.2385 4.1279 4.4154 4.0543 4.2913 2.1027 2.1166 6.4916 7.0477 7.2723 6.7971 1.0891 1.0890 1.0890 1.0890 1.0968 1.0967 1.0979 1.0979
irintensity: 0.0006 0.0588 0.0415 0.1212 0.0273 0.2101 0.5725 1.0207 0.9679 0.7892 9.6850 7.7088 2.0666 3.9346 0.8792 2.1588 0.0190 0.0101 3.3800 8.1415 8.4960 46.0723 0.2107 0.1306 3.0732 3.0927 25.7562 18.9140 0.1180 1.8374 114.1291 6.1896 0.0121 0.0775 0.0283 0.0341 91.7223 49.3884 42.9087 70.7725 4.0680 0.2556 6.7736 3.4597 10.6669 0.0079 0.4733 0.1981 0.5961 0.2419 8.9074 18.3436 47.5389 57.1354 59.1535 26.1388 15.7111 51.9970 1.3659 0.1286 0.6900 0.7383 6.3942 4.1234 3.3317 0.3979
temp: 298.150 k
press: 1.00000 atm
elementType: 35 35 16 16 6 6 6 6 6 6 6 6 6 6 6 6 1 1 1 1 1 1 1 1
symmnumber: 1
zpe: 419129.7 jmol-1
zpe.correction: 0.159638 hartree
zpe.thermalcorrener: 0.175557 hartree
zpe.thermalcorrenthalpy: 0.176501 hartree
zpe.thermalcorrgfe: 0.109889 hartree
zpe.sumelectzpe: -1283.992909 hartree
zpe.sumelectthermal: -1283.976990 hartree
zpe.sumelectthermalent: -1283.976046 hartree
zpe.sumelectthermalfe: -1284.042658 hartree
dipole: 0.0065 -0.4541 -0.0007
dipole: 0.4542
quadrupole: -125.2528 -129.0258 -127.4414
quadrupole: 0.1050 5.5573 -0.1027
quadrupole: 1.9872 -1.7858 -0.2014 0.1050 5.5573 -0.1027
hfenergy: -1284.1525469 hartree
pointgroup: C01 [X(C12H8Br2S2)]
dipole: -0.0013266 -0.1783337 0.0110654 debye
dipolederiv: -0.4467515 0.3274377 -0.1023591 0.4831775 -0.4475233 0.1022257 -0.1719329 0.1272809 -0.0704365 -0.482709 -0.3369949 -0.0648146 -0.5015868 -0.4332652 -0.0513185 -0.1157397 -0.0730454 -0.0493246 0.0912817 -0.3401966 -0.0613938 -0.3993589 0.0796131 -0.0748688 0.1768123 -0.0084641 -0.0095799 0.1266199 0.3280231 -0.0985052 0.4133775 0.0491182 0.0686969 0.1334135 -0.0092442 -0.0199469 0.003369 -0.0755746 0.0763245 0.0460665 -0.1002048 0.0087489 -0.057603 0.1779268 -0.1269647 0.0077199 0.0808492 0.0652082 -0.0561321 -0.1241867 -0.0122207 -0.0566801 -0.1733998 -0.1032879 -0.107116 0.1089674 0.0773143 -0.2569553 0.0706688 -0.0417056 -0.0363247 0.0575416 -0.0358225 0.1009258 0.132638 -0.0034276 -0.1932625 0.0325784 -0.0742293 0.175142 0.043062 -0.0537128 0.1052064 -0.1356424 0.0172202 0.2126143 0.0336396 0.06034 0.1468972 -0.0633629 -0.0573783 -0.1054019 -0.0894941 0.0934765 0.2572428 0.0605735 0.0261874 -0.072264 -0.0683165 -0.0304336 -0.4212935 0.1782814 -0.0773877 0.2992955 -0.1394142 0.1363644 -0.1622727 0.1003494 -0.1018166 -0.1739723 -0.2466277 0.0767753 -0.3125735 -0.3739185 0.0269035 0.0457377 -0.0539485 -0.0461122 -0.1451065 0.2454662 0.0431656 0.3055406 -0.392523 0.013127 0.0076933 0.0939789 -0.0569928 -0.4383811 -0.173007 -0.063585 -0.3024042 -0.1480932 -0.128989 -0.1295778 -0.0882856 -0.0727797 0.688395 -0.6101935 0.2831456 -0.7891806 0.8170516 -0.1880108 0.3560099 -0.2114994 0.023908 0.747999 0.646829 0.2119668 0.8366198 0.7873058 0.0768121 0.2619382 0.0967443 -0.0071979 0.0093804 -0.0147496 -0.0863014 -0.0165631 0.0600616 0.0073564 -0.0866894 -0.0095105 0.0882897 0.1179377 -0.0343309 -0.0260908 0.0112255 -0.0116636 0.0570081 -0.0205339 0.0459017 0.1012451 0.1174596 0.0229491 -0.0322674 -0.0213819 -0.0240115 -0.0383617 -0.0196756 -0.0278614 0.1140052 0.0132722 0.0048561 -0.0888575 0.0067459 0.0610203 0.0002972 -0.0885242 0.0174625 0.0850724 0.0991024 -0.0174969 -0.0311694 0.0138001 -0.0302651 -0.0508895 -0.04223 -0.0372005 0.1260736 -0.0027067 -0.0002077 -0.0896815 -0.0167763 0.0971245 0.0217711 -0.1023272 0.024284 0.0921534 -0.005349 -0.0081464 -0.0887973 0.0069969 0.0911152 -0.0171493 -0.1034992 -0.0187376 0.1010435 0.1001184 0.006365 -0.0299588 -0.0265277 -0.0148017 0.0719046 -0.0377697 0.0583445 0.1099962 unknown
polarizability: 307.5075406|0.4310723|227.7465682|28.6850964|-7.98179|114.3630017 unknown
InChI: InChI=1S/C12H8Br2S2/c13-9-1-5-11(6-2-9)15-16-12-7-3-10(14)4-8-12/h1-8H
charge 0 multiplicity 1
24 atoms
Br 4.825753 -2.56545 0.643417
Br -4.937682 -2.409933 -0.335328
S  0.775666 2.354723 -1.068385
S  -0.669403 2.501604 0.767606
C  1.877534 0.989181 -0.550656
C  -1.832753 1.132018 0.420352
C  1.598618 -0.335279 -0.972122
C  -2.962707 1.343562 -0.408675
C  3.03219 1.255986 0.226831
C  -1.624955 -0.133934 1.023479
C  2.469155 -1.39234 -0.622566
C  -3.883723 0.29817 -0.637007
C  3.907811 0.207451 0.583506
C  -2.542509 -1.186716 0.804936
C  3.612455 -1.105052 0.153021
C  -3.659603 -0.955276 -0.025346
H  0.707289 -0.536483 -1.574532
H  -3.120144 2.322484 -0.871667
H  3.243995 2.279858 0.549727
H  -0.752047 -0.292808 1.664135
H  2.258863 -2.414028 -0.950745
H  -4.757847 0.458877 -1.274142
H  4.801224 0.410433 1.18055
H  -2.387077 -2.162445 1.273607
