program: Gaussian 09
title: 000219552
version: EM64L-G09RevD.01
frameworkgroup: C1[X(C15H14N2S)]
method: RPBEPBE
basis: SDD
operation: Freq
keyword: #p
keyword: freq=noraman
keyword: PBEPBE/SDD
title: #p freq=noraman PBEPBE/SDD
converged: YES YES NO NO
title: Mulliken charges:
elementType: S N N C C C C C C C C C C C C C C C H H H H H H H H H H H H H H
charge: 0.309774 -0.167224 0.005878 -0.575485 0.458185 0.457791 -0.668503 -0.364940 -0.336900 -0.416788 -0.372759 -0.192987 -0.219214 -0.260418 -0.218659 -0.231941 -0.239736 -0.344603 0.241176 0.246654 0.230118 0.246907 0.243318 0.245307 0.242141 0.230112 0.257528 0.251321 0.252330 0.228254 0.231384 0.231976
chargesum: 0.00000
title: Mulliken charges with hydrogens summed into heavy atoms:
elementType: S N N C C C C C C C C C C C C C C C
charge: 0.309774 -0.167224 0.005878 -0.087655 0.458185 0.457791 0.051840 -0.119633 -0.094758 -0.186675 -0.115231 0.058335 0.033116 -0.260418 0.009595 -0.000556 -0.007760 -0.344603
polarizability: 2.79818184e+02 1.74218872e+01 1.72676263e+02 1.21299016e+01 1.01104951e+01 1.32158349e+02
1716.lowfreq: -12.9424 -4.8253 -3.5372 -0.0016 -0.0005 0.0006 14.1171 17.0467 25.2688
frequency: 13.5867 16.7789 25.2568 50.6732 57.4817 103.1406 118.9540 159.1955 184.7681 203.0161 228.0949 253.1457 288.4059 332.3902 355.2622 372.5217 403.3079 415.1146 428.6797 455.1171 461.6510 494.0826 524.3079 561.9335 605.7408 614.0723 624.2939 635.0810 703.7368 707.4932 736.9317 756.9225 788.8794 804.3489 816.5369 856.3076 901.9254 940.4177 946.1971 953.8121 978.1920 979.5205 989.4045 993.3911 1001.0985 1027.0432 1074.8702 1085.1073 1106.4981 1112.8838 1126.3302 1173.1135 1186.6666 1194.7610 1201.9280 1214.3892 1259.6329 1302.2325 1304.4149 1346.1117 1367.3724 1380.3354 1391.0076 1423.9237 1439.7792 1446.3868 1471.1138 1478.0371 1486.4698 1491.9892 1509.9321 1557.6944 1594.8136 1611.9603 1614.4836 2098.9546 2945.4867 2974.3395 3028.2823 3035.4388 3096.6071 3110.6433 3127.2273 3138.4120 3144.1428 3148.2580 3149.4671 3164.6584 3165.1250 3173.9741
redmass: 5.0976 7.2867 5.5561 3.6948 6.0801 3.1784 6.1910 4.0629 1.3999 3.5189 4.7510 5.0220 5.1680 4.7570 4.3106 11.3571 2.8287 3.0899 3.2589 2.5870 5.0539 3.4268 3.0099 5.5401 13.2177 6.2048 6.8571 5.6463 2.2334 3.4025 1.5830 4.0679 3.8404 1.2824 1.7974 1.2469 1.4336 1.3212 2.4890 1.3524 2.4850 1.8510 6.1926 1.7515 1.5111 2.1730 2.7247 1.5655 1.5701 1.5201 1.4237 1.0543 1.1844 2.3104 1.1351 1.7794 1.8212 1.3767 1.3712 1.3849 4.7734 3.3178 3.0252 3.5386 1.9655 1.2917 1.1324 1.3152 1.4595 1.3079 2.0838 7.0352 6.0941 5.9658 5.8998 12.7536 1.0433 1.0634 1.0976 1.0931 1.0982 1.0881 1.0859 1.0910 1.0877 1.0887 1.0955 1.0974 1.1004 1.0955
irintensity: 0.8671 0.6640 0.4316 0.2585 2.7549 1.8138 1.0443 1.0825 1.0160 5.3617 1.8843 1.1946 1.2981 5.6331 1.2376 0.2008 0.1077 0.5086 3.7110 6.2520 14.3670 9.9812 29.7424 5.8140 6.4072 0.8901 0.9183 2.3404 27.6347 4.1767 53.4504 8.8242 2.5612 0.2715 72.1300 0.4194 8.3724 0.8518 30.0766 0.3529 1.4196 1.0776 0.7572 6.5581 5.3116 8.8420 11.6267 4.8610 12.9928 25.5802 7.6872 0.0659 7.1312 0.8728 40.8136 42.1730 52.3367 16.0172 4.0433 30.6655 7.1451 70.3379 7.3330 1.8756 8.0162 31.3595 40.0761 9.3744 4.8116 4.6031 208.3627 4.7673 3.4440 245.8362 46.8058 21.8368 79.7525 49.6865 8.0280 26.9155 15.9894 10.4442 0.7828 12.5054 11.7552 6.5438 31.9604 6.0855 28.3838 8.7698
temp: 298.150 k
press: 1.00000 atm
elementType: 16 7 7 6 6 6 6 6 6 6 6 6 6 6 6 6 6 6 1 1 1 1 1 1 1 1 1 1 1 1 1 1
symmnumber: 1
zpe: 653899.6 jmol-1
zpe.correction: 0.249057 hartree
zpe.thermalcorrener: 0.266028 hartree
zpe.thermalcorrenthalpy: 0.266973 hartree
zpe.thermalcorrgfe: 0.200427 hartree
zpe.sumelectzpe: -1086.249091 hartree
zpe.sumelectthermal: -1086.232120 hartree
zpe.sumelectthermalent: -1086.231176 hartree
zpe.sumelectthermalfe: -1086.297722 hartree
dipole: -6.2555 -4.1063 -1.1064
dipole: 7.5642
quadrupole: -125.3402 -112.9850 -112.5851
quadrupole: -12.5445 -4.8435 -6.9425
quadrupole: -8.3701 3.9851 4.3850 -12.5445 -4.8435 -6.9425
hfenergy: -1086.4981486 hartree
pointgroup: C01 [X(C15H14N2S1)]
dipole: -2.5039114 -1.60785 -0.0419086 debye
polarizability: 281.171019|16.8459348|174.0482079|2.2389428|1.7788396|129.4335696 unknown
InChI: InChI=1S/C15H14N2S/c1-17(11-13-5-3-2-4-6-13)14-7-9-15(10-8-14)18-12-16/h2-10H,11H2,1H3
charge 0 multiplicity 1
32 atoms
S  4.956559 -0.122503 -1.067176
N  -0.804101 -1.560373 0.371991
N  5.435419 2.381801 0.427823
C  -1.924695 -1.397686 -0.568556
C  0.509425 -1.216989 0.041306
C  -2.823842 -0.184895 -0.303739
C  -1.11027 -2.201355 1.659195
C  1.605676 -1.652381 0.85568
C  0.8125 -0.412115 -1.106776
C  -4.19156 -0.229407 -0.673437
C  -2.307758 0.999105 0.278617
C  2.930816 -1.305926 0.535077
C  2.139706 -0.075211 -1.424989
C  3.199971 -0.518946 -0.604563
C  -5.027707 0.892732 -0.477262
C  -3.143224 2.121527 0.478432
C  -4.504566 2.073693 0.09871
C  5.209693 1.365077 -0.167117
H  -2.54463 -2.316203 -0.539307
H  -1.520611 -1.348599 -1.596728
H  -0.804165 -3.268336 1.684397
H  -2.196428 -2.146722 1.836973
H  -0.61138 -1.676025 2.494087
H  1.427516 -2.279345 1.733173
H  0.011225 -0.015112 -1.736734
H  -4.605712 -1.145156 -1.115444
H  -1.25606 1.036746 0.58379
H  3.752342 -1.654267 1.169387
H  2.346348 0.548618 -2.300524
H  -6.083779 0.844208 -0.765785
H  -2.731925 3.031608 0.929414
H  -5.151584 2.943936 0.254886
