program: Gaussian 09
title: 000000293
version: EM64L-G09RevD.01
frameworkgroup: C1[X(C11H20N4O11P2)]
method: RPBEPBE
basis: SDD
operation: Freq
keyword: #p
keyword: freq=noraman
keyword: PBEPBE/SDD
title: #p freq=noraman PBEPBE/SDD
converged: YES YES NO NO
title: Mulliken charges:
elementType: P P O O O O O O O O O O O N N N N C C C C C C C C C C C H H H H H H H H H H H H H H H H H H H H
charge: 1.482025 1.444628 -0.306810 -0.432546 -0.465584 -0.498652 -0.325179 -0.792992 -0.779194 -0.550209 -0.526497 -0.678472 -0.557991 -0.212287 -0.043866 -0.618729 -0.645894 -0.177787 -0.152452 0.016478 -0.111203 -0.341131 -0.067540 0.109487 -0.344270 0.191935 -0.249221 -0.393661 0.225486 0.261644 0.253795 0.327787 0.257234 0.261011 0.365819 0.391034 0.303348 0.239168 0.424052 0.324422 0.344394 0.277984 0.246353 0.204520 0.236244 0.460155 0.338128 0.285037
chargesum: 0.00000
title: Mulliken charges with hydrogens summed into heavy atoms:
elementType: P P O O O O O O O O O O O N N N N C C C C C C C C C C C
charge: 1.482025 1.444628 -0.306810 -0.066728 -0.074550 -0.498652 -0.325179 -0.792992 -0.355142 -0.550209 -0.526497 -0.218317 -0.557991 -0.212287 -0.043866 0.050086 -0.022729 0.047699 0.109191 0.270274 0.216584 0.177115 0.235808 0.109487 -0.105103 0.191935 0.275116 0.047102
polarizability: 2.75100837e+02 8.42381123e+00 2.55692732e+02 1.49784936e+01 5.39297884e+00 1.91324196e+02
1716.lowfreq: -6.6219 -4.2719 0.0012 0.0016 0.0017 7.3078 18.6389 24.2870 33.1237
frequency: 18.5373 24.2523 33.1084 44.0563 51.5661 55.9906 66.4040 75.0175 87.0181 92.9774 107.5263 111.4382 122.6323 149.8136 158.9883 169.6139 182.7124 191.1794 196.8669 200.3280 213.6128 222.0302 234.6745 249.5562 257.0810 268.1780 281.2590 285.7897 303.5810 328.0460 332.5870 350.6246 357.6302 365.8003 373.9037 375.2709 381.3637 409.1330 418.3141 430.1240 435.9968 444.6321 453.4280 476.0694 499.3359 535.4345 536.9765 557.1661 574.5403 576.1901 590.3451 605.8882 625.6128 653.0915 688.6523 695.3422 695.8542 732.9419 745.0069 748.3811 778.7066 785.9455 795.8909 800.6736 803.2765 813.3005 829.1305 898.6410 932.0523 936.1214 965.4750 979.4513 980.2737 998.8339 1001.5253 1012.5214 1023.9378 1031.4550 1039.7081 1049.9957 1056.7562 1070.2373 1078.3906 1085.8303 1106.8181 1110.1507 1135.5613 1158.6194 1167.3916 1189.1515 1221.2358 1226.1637 1236.7862 1262.1185 1267.0460 1277.9773 1282.5085 1304.0395 1312.9391 1315.4763 1322.3626 1325.4848 1328.2558 1344.5737 1373.8437 1377.7420 1384.1317 1399.1953 1414.3902 1448.8739 1466.9487 1473.1352 1480.3774 1504.1654 1574.9743 1626.0386 1638.1912 1657.5983 2973.3224 2977.3185 2982.4810 2988.5992 3005.2371 3013.0039 3017.9958 3034.2857 3041.0513 3088.8586 3099.5705 3175.5265 3195.4242 3214.2624 3439.0913 3540.4179 3573.2151 3615.4662 3630.3669 3696.9479
redmass: 9.1492 8.1693 6.2031 6.2290 9.1191 6.6476 6.7199 7.3335 5.7230 6.6682 6.8014 4.5318 2.2178 2.6864 5.7163 5.0268 5.9176 6.2842 6.2029 8.3843 7.8626 6.6431 5.3847 4.3790 7.3480 5.0735 4.8400 5.9899 4.6231 4.1833 3.1911 3.1225 3.3693 2.4358 2.7686 1.4096 2.5551 4.2071 5.5856 3.2143 4.6761 5.0665 1.1629 4.8607 7.1204 5.5256 4.9030 4.6915 4.1226 1.4541 4.1236 1.2982 11.6941 6.1671 3.3100 3.1811 9.7330 1.4147 7.0435 6.1794 1.3514 1.7522 4.0438 3.6206 5.9208 1.3547 3.4529 8.2319 3.1529 8.2015 5.1108 1.3135 1.2809 3.5641 1.4170 4.3167 2.3035 2.9113 4.5579 3.7750 3.0190 2.6088 11.7141 3.0782 5.2665 3.8487 2.2441 1.2327 1.7938 1.3568 5.7003 1.0759 1.1450 1.2537 1.3818 1.4998 1.1746 1.2486 1.1555 1.1342 1.2684 1.2451 1.3037 1.5029 1.4039 1.4558 1.4213 1.6400 1.6140 1.0796 1.0722 4.8313 1.0881 4.4241 3.1631 1.7374 5.3187 1.0881 1.0826 1.0632 1.0863 1.0867 1.0634 1.0580 1.0803 1.0689 1.0990 1.1078 1.1114 1.0893 1.1002 1.0640 1.0535 1.0455 1.0663 1.0947 1.0665 1.1045
irintensity: 1.9136 1.6535 3.8112 5.7822 0.2889 1.4785 3.9618 2.2545 0.7374 0.4432 1.5193 1.4080 5.0371 1.6170 8.2000 8.7553 1.9778 6.7793 10.5654 4.4159 4.9767 7.4347 27.9970 9.6341 10.1401 1.2030 9.3476 13.5356 11.4737 17.6383 5.2670 88.0136 25.5395 22.1459 20.5441 173.1034 60.3170 40.0150 28.1185 2.4660 8.7810 46.1207 135.3119 28.0572 17.0114 4.3758 6.6814 8.6198 57.5593 118.4222 53.0416 238.5011 97.5718 8.3824 48.9154 2.8383 122.9765 217.4713 2.3885 9.3274 13.1976 45.1759 223.9334 297.4237 193.2780 134.8726 73.0626 175.0570 6.2251 326.7701 185.5327 10.0211 7.8873 18.1835 49.4213 79.1956 24.3425 11.3559 31.5073 9.6930 24.0201 67.2018 102.3787 137.0362 228.5400 33.6386 13.3471 4.6699 18.7045 25.0064 36.1058 20.5807 28.1957 1.9487 25.8998 93.1976 3.2404 33.9748 152.0362 100.0120 4.1574 16.6340 55.4095 78.9735 24.3994 1.5413 30.6839 74.0599 120.9421 8.7440 9.1689 113.3378 13.2993 120.8039 166.5500 82.7380 831.9005 28.1025 2.1753 79.5582 60.9972 6.1052 15.9159 18.8424 19.9736 525.1655 44.5131 2.8033 19.3893 2.3562 5.6099 376.7927 93.2368 135.1999 24.1799 36.6746 105.7254 42.0800
temp: 298.150 k
press: 1.00000 atm
elementType: 15 15 8 8 8 8 8 8 8 8 8 8 8 7 7 7 7 6 6 6 6 6 6 6 6 6 6 6 1 1 1 1 1 1 1 1 1 1 1 1 1 1 1 1 1 1 1 1
symmnumber: 1
zpe: 916425.1 jmol-1
zpe.correction: 0.349048 hartree
zpe.thermalcorrener: 0.379407 hartree
zpe.thermalcorrenthalpy: 0.380351 hartree
zpe.thermalcorrgfe: 0.287076 hartree
zpe.sumelectzpe: -2157.889345 hartree
zpe.sumelectthermal: -2157.858986 hartree
zpe.sumelectthermalent: -2157.858042 hartree
zpe.sumelectthermalfe: -2157.951317 hartree
dipole: -3.5682 -1.5757 3.9301
dipole: 5.5371
quadrupole: -179.1736 -171.6473 -181.4697
quadrupole: 28.8512 31.2659 2.8619
quadrupole: -1.7434 5.7828 -4.0395 28.8512 31.2659 2.8619
hfenergy: -2158.2383928 hartree
pointgroup: C01[X(C11H20N4O11P2)]
dipole: 1.054045 -1.8158823 0.5808143 debye
polarizability: 274.7852834|-0.2813325|188.6551886|11.8219375|-3.289607|258.677293 unknown
InChI: InChI=1S/C11H20N4O11P2/c12-2-4-23-27(19,20)26-28(21,22)24-5-6-8(16)9(17)10(25-6)15-3-1-7(13)14-11(15)18/h1,3,6,8-10,16-17,19,21H,2,4-5,12-13H2
charge 0 multiplicity 1
48 atoms
P  -3.532431 -0.132777 1.840773
P  -3.646227 2.235583 -0.400891
O  0.233932 -0.282249 0.471646
O  0.226913 -3.41975 -1.391645
O  2.331109 -1.112689 -2.329225
O  -2.418938 -1.35091 1.394198
O  4.226916 -0.143255 -0.729858
O  -3.083875 1.262065 0.996973
O  -4.982472 -0.469634 0.876059
O  -3.784081 -0.081715 3.392583
O  -2.615347 1.610785 -1.619218
O  -5.130383 1.538547 -0.785187
O  -3.579645 3.78103 -0.109054
N  2.604565 -0.124044 0.960205
N  4.955207 0.078544 1.488254
N  5.650706 0.293104 3.690347
N  0.882523 1.605364 -2.916703
C  0.316807 -1.978001 -1.217104
C  1.748876 -1.439534 -1.041241
C  -0.359139 -1.605704 0.118465
C  1.570867 -0.190315 -0.122434
C  -1.866516 -1.465378 0.013228
C  2.265654 -0.024775 2.290964
C  3.986897 -0.061016 0.524376
C  3.245103 0.107798 3.258295
C  4.61447 0.15714 2.799777
C  -1.183926 2.081021 -1.664807
C  -0.581684 1.501418 -2.960254
H  -0.155936 -1.440252 -2.066171
H  2.352769 -2.206116 -0.511726
H  -0.096386 -2.358572 0.887213
H  1.622544 0.739284 -0.723584
H  -2.13599 -0.585144 -0.599522
H  -2.29016 -2.385457 -0.424958
H  0.686983 -3.667082 -2.233171
H  3.236592 -0.73578 -2.07705
H  1.195729 -0.04997 2.511742
H  2.976219 0.18433 4.313153
H  -5.610389 -1.132574 1.254385
H  5.494102 0.362426 4.692131
H  6.597994 0.332127 3.31648
H  -0.656636 1.675337 -0.784763
H  -1.162968 3.185802 -1.649465
H  -0.878265 0.438025 -3.029652
H  -1.032984 2.008417 -3.836076
H  -5.322134 0.681962 -0.261667
H  1.41053 0.733517 -3.035674
H  1.297504 2.424367 -3.360248
