program: Gaussian 09
title: 000219537
version: EM64L-G09RevD.01
frameworkgroup: C1[X(C12H17NO2)]
method: RPBEPBE
basis: SDD
operation: Freq
keyword: #p
keyword: freq=noraman
keyword: PBEPBE/SDD
title: #p freq=noraman PBEPBE/SDD
converged: YES YES NO NO
title: Mulliken charges:
elementType: O O N C C C C C C C C C C C C H H H H H H H H H H H H H H H H H
charge: -0.284312 -0.210320 0.024979 -0.363311 -0.352905 -0.375668 -0.354246 -0.308132 -0.694714 0.234859 -0.055428 -0.268633 -0.177539 -0.160472 -0.354045 0.198738 0.186367 0.188630 0.195643 0.205605 0.234937 0.197485 0.193832 0.221711 0.232624 0.216337 0.209388 0.211903 0.279576 0.243196 0.235168 0.248747
chargesum: 0.00000
title: Mulliken charges with hydrogens summed into heavy atoms:
elementType: O O N C C C C C C C C C C C C
charge: -0.284312 -0.210320 0.024979 0.021794 0.031369 0.064874 0.037070 0.146203 -0.057085 0.234859 -0.055428 0.010942 0.065657 0.074697 -0.105298
polarizability: 2.00136904e+02 1.99127283e+00 1.32066413e+02 1.97476396e+01 -1.44982182e+00 9.68386688e+01
1716.lowfreq: -26.8825 -0.0006 -0.0004 0.0001 0.7529 6.3968 18.2188 29.3400 33.9248
frequency: -2.9691 29.0495 32.6472 41.1157 65.6906 101.3765 112.7300 127.1007 145.0372 166.4616 226.0480 236.4413 260.9366 316.8113 369.4226 396.8044 416.2098 433.8359 448.4045 524.5590 610.0822 676.7663 680.1999 726.6902 746.6164 748.1834 761.8429 805.3860 811.4105 884.9917 889.0267 914.7174 915.0075 961.6862 970.9921 990.1132 1008.4898 1012.0225 1031.9108 1040.1193 1054.1073 1064.9432 1081.1225 1098.3997 1121.4415 1163.5105 1166.9343 1202.8877 1227.1707 1236.8329 1255.3679 1282.9625 1291.6792 1292.8088 1295.6758 1298.7248 1321.7366 1341.2548 1355.9507 1369.6403 1386.5741 1408.5829 1443.7225 1452.5738 1465.1992 1466.2659 1474.3630 1476.1683 1482.6644 1488.8087 1559.8048 1571.5555 1647.4688 2954.7038 2959.0530 2968.9380 2972.3773 2990.4358 2993.6516 3008.6960 3019.2796 3032.4838 3054.6284 3069.2304 3071.8783 3098.9467 3132.3181 3146.8151 3168.5087 3190.7679
redmass: 2.8693 4.4086 2.3066 4.7458 3.2734 3.7107 1.8147 2.2728 4.6286 4.1993 1.1397 3.3674 3.9731 4.9056 4.9911 3.1733 3.1656 4.7128 4.3731 4.7578 7.3599 5.3364 4.6002 1.0700 1.1935 1.7634 2.6253 1.3792 2.5752 2.0433 1.2618 4.1645 1.4081 6.9026 1.4602 1.1554 3.8734 1.3500 3.7157 2.7453 3.1768 2.8151 2.2072 1.8527 2.6750 1.2151 1.5003 1.4830 3.3093 1.2789 1.2741 1.0536 1.2156 1.5116 1.2267 1.1647 9.1747 1.4185 1.6376 1.3715 1.2160 1.9182 2.0579 1.1141 1.0679 1.0736 1.0713 1.0427 1.0802 1.0928 5.6659 5.9493 10.8623 1.0587 1.0590 1.0593 1.0363 1.0732 1.0837 1.1010 1.0574 1.1040 1.1035 1.1008 1.0993 1.1084 1.0883 1.0908 1.0984 1.0967
irintensity: 2.2855 0.2077 0.9048 0.1026 0.9989 0.5984 0.3603 0.0884 0.8794 0.9662 0.0731 1.5932 3.4134 10.3492 1.4344 4.0535 0.3057 1.0778 3.1801 1.6323 3.5929 11.5879 33.7674 11.0002 4.2824 41.4191 8.7544 0.0584 19.2908 12.9738 1.8841 12.0400 1.7982 3.9917 1.3727 0.2002 1.0786 0.2876 65.1649 11.9795 235.0084 15.1849 0.3826 100.5054 3.8345 12.5041 8.1550 10.9572 161.3120 5.1692 0.3755 0.7870 0.5991 10.3802 8.9761 1.7878 5.0915 0.7075 1.1153 0.2617 11.2853 12.7854 13.4628 7.3125 0.4301 0.4322 1.4187 12.5904 2.8924 25.3652 29.6560 1.6348 143.1582 2.3686 7.7912 93.2016 35.8317 11.4298 13.2170 0.8045 51.0175 39.4004 28.9652 91.6402 54.7406 29.4089 9.2027 14.2818 26.6320 3.5414
temp: 298.150 k
press: 1.00000 atm
elementType: 8 8 7 6 6 6 6 6 6 6 6 6 6 6 6 1 1 1 1 1 1 1 1 1 1 1 1 1 1 1 1 1
symmnumber: 1
zpe: 701708.8 jmol-1
zpe.correction: 0.267267 hartree
zpe.thermalcorrener: 0.282296 hartree
zpe.thermalcorrenthalpy: 0.283240 hartree
zpe.thermalcorrgfe: 0.222634 hartree
zpe.sumelectzpe: -671.525204 hartree
zpe.sumelectthermal: -671.510175 hartree
zpe.sumelectthermalent: -671.509231 hartree
zpe.sumelectthermalfe: -671.569837 hartree
dipole: -0.5397 -4.0279 -0.3969
dipole: 4.0832
quadrupole: -68.0997 -94.2753 -90.1943
quadrupole: 8.0597 6.6448 -1.2421
quadrupole: 16.0901 -10.0855 -6.0045 8.0597 6.6448 -1.2421
hfenergy: -671.7924708 hartree
pointgroup: C01 [X(C12H17N1O2)]
dipole: 0.187173 -1.5833351 -0.1969132 debye
polarizability: 201.1632086|-6.7395825|129.9601355|15.4451216|8.7703269|97.9186421 unknown
InChI: InChI=1S/C12H17NO2/c1-2-3-4-7-10-15-12(14)11-8-5-6-9-13-11/h5-6,8-9H,2-4,7,10H2,1H3
charge 0 multiplicity 1
32 atoms
O  0.277882 -0.383624 -1.067051
O  0.586312 1.822175 -0.359174
N  3.268949 1.142095 0.329357
C  -3.544989 0.038986 -0.626002
C  -4.52182 -0.148532 0.55687
C  -2.072905 -0.230577 -0.234292
C  -5.994345 0.129106 0.177309
C  -1.132175 -0.055148 -1.433771
C  -6.966598 -0.063437 1.361086
C  1.033926 0.668408 -0.521591
C  2.426752 0.194688 -0.187744
C  2.817779 -1.151948 -0.404026
C  4.136102 -1.534827 -0.07326
C  5.015668 -0.565925 0.459923
C  4.535727 0.754177 0.641588
H  -3.639969 1.073409 -1.016415
H  -3.841426 -0.638316 -1.454466
H  -4.433588 -1.183847 0.947514
H  -4.224606 0.524142 1.387876
H  -1.972848 -1.259744 0.162177
H  -1.767905 0.465772 0.569333
H  -6.080923 1.164795 -0.210007
H  -6.288254 -0.540355 -0.657069
H  -1.365009 -0.765802 -2.244508
H  -1.164849 0.982378 -1.813151
H  -8.011828 0.140404 1.064327
H  -6.920645 -1.099244 1.747485
H  -6.713706 0.61665 2.196299
H  2.099062 -1.861071 -0.820017
H  4.468598 -2.566333 -0.228827
H  6.045912 -0.818917 0.729719
H  5.185022 1.535659 1.052707
