program: Gaussian 09
title: 000219534
version: EM64L-G09RevD.01
frameworkgroup: C1[X(C12H24O2)]
method: RPBEPBE
basis: SDD
operation: Freq
keyword: #pfreq=noraman
keyword: PBEPBE/SDD
title: #p freq=noraman PBEPBE/SDD
converged: YES YES NO NO
title: Mulliken charges:
elementType: O O C C C C C C C C C C C C H H H H H H H H H H H H H H H H H H H H H H H H
charge: -0.436864 -0.235975 0.249997 0.298561 -0.472911 0.290293 -0.787825 -0.752839 -0.760102 -0.750843 0.099055 -0.728395 -0.730231 -0.721569 0.244795 0.193092 0.228037 0.223947 0.227880 0.230231 0.212590 0.224948 0.224809 0.259299 0.203643 0.213636 0.235012 0.214934 0.209673 0.211098 0.215033 0.206622 0.204350 0.237175 0.207631 0.216527 0.221586 0.373101
chargesum: 0.00000
title: Mulliken charges with hydrogens summed into heavy atoms:
elementType: O O C C C C C C C C C C C C
charge: -0.063764 -0.235975 0.249997 0.298561 -0.035024 0.290293 -0.107962 -0.085070 -0.072351 -0.087261 0.099055 -0.092591 -0.082084 -0.075825
polarizability: 1.44661164e+02 1.09120457e+00 1.32557386e+02 9.09391492e-01 -7.06439245e-01 1.27138249e+02
1716.lowfreq: -12.5524 -9.1033 -0.0004 -0.0004 0.0006 22.3935 61.6028 73.6996 90.0023
frequency: 61.5757 73.5478 89.9165 103.6883 147.6950 170.1912 197.7254 215.3692 224.5188 241.4242 251.4945 258.9880 267.8024 281.5511 288.3360 304.8279 307.4040 325.5945 331.2561 366.5110 376.4274 386.9836 403.9979 413.1380 419.9686 446.0704 499.9461 522.1459 562.6366 595.8634 652.9874 712.3737 742.3190 782.4671 828.8742 876.8054 898.2549 918.4034 926.2313 927.1462 928.1623 941.3105 948.0144 952.5519 1005.2493 1015.7829 1020.3437 1029.1058 1034.7030 1094.5201 1108.2986 1162.2375 1200.8570 1201.1955 1211.8853 1227.4278 1233.9832 1250.5392 1278.8205 1323.3165 1347.3379 1372.1398 1377.4358 1379.1816 1383.3341 1395.1786 1403.2461 1411.1757 1447.9329 1455.1745 1461.9904 1464.9584 1466.3795 1470.4357 1471.6514 1476.1228 1479.0486 1485.3052 1488.4838 1493.4889 1499.4273 1501.3681 1504.3861 1636.4769 2963.3370 2970.4781 2973.9409 2977.0187 2980.2137 2980.7276 2985.9736 3010.7966 3051.6516 3056.1009 3060.0561 3063.6385 3064.8311 3068.0462 3069.2959 3072.5933 3076.5957 3081.7648 3085.7156 3096.0243 3100.8049 3104.0679 3114.1478 3500.1437
redmass: 2.7077 5.0801 4.2214 3.3740 2.5441 2.4581 1.5391 1.1823 1.8009 1.4053 1.5743 1.3391 1.3215 1.1901 1.4326 1.6332 2.2560 2.6848 2.1627 2.1005 1.9262 2.4552 2.5536 2.5427 1.8854 2.3196 2.5012 3.1150 2.3061 2.1087 2.2102 3.9937 4.1794 2.9267 2.3021 2.4868 1.9313 1.7859 1.7079 1.5605 1.6751 1.2202 1.2038 1.8834 1.6036 1.6342 1.4534 1.3901 1.7878 1.8009 1.6571 3.0800 2.2318 2.2354 2.5601 2.7768 3.1123 3.1485 2.3827 1.6514 1.2783 1.1998 1.1943 1.2001 1.1953 1.2058 1.2010 1.1929 1.0721 1.0498 1.0524 1.0502 1.0525 1.0495 1.0547 1.0505 1.0546 1.0524 1.0550 1.0548 1.0578 1.0578 1.0544 7.9063 1.0350 1.0366 1.0426 1.0365 1.0361 1.0536 1.0387 1.0361 1.0991 1.0985 1.0994 1.0993 1.0988 1.0984 1.0986 1.0979 1.0994 1.0993 1.0985 1.0976 1.0992 1.0964 1.1001 1.0637
irintensity: 0.0635 0.5107 0.1903 0.0562 0.1596 0.0098 0.2589 0.0239 0.0235 0.0339 0.1455 0.0641 0.2504 0.2024 0.4059 0.1235 0.7446 1.6201 1.6108 0.3099 0.9689 0.7436 2.5459 0.4872 1.0789 2.2149 4.3054 15.2350 24.3073 56.1566 58.9294 5.2592 10.1561 14.2758 2.7672 0.2303 10.5799 8.0567 0.5167 1.9257 1.3355 0.7342 0.2867 17.5642 19.0040 60.7693 19.4489 0.8897 96.3191 11.4278 23.7730 2.5205 33.1461 16.6515 13.0142 2.2893 4.0101 20.3350 5.0248 8.7815 7.1229 16.0651 9.0994 32.5560 23.3463 32.3853 21.4156 17.2071 2.6367 5.2130 0.4435 1.4476 2.0506 0.7099 1.3660 6.6863 10.1472 3.2603 8.8911 16.6436 25.9151 2.3014 22.8521 188.8557 30.6660 40.5438 29.8476 21.6198 25.3260 18.6015 45.9314 15.3597 6.9041 2.6703 29.3783 25.3631 24.7887 34.7092 87.7657 53.8167 39.1445 18.8239 51.4102 63.8864 16.9751 14.4641 18.3993 21.1940
temp: 298.150 k
press: 1.00000 atm
elementType: 8 8 6 6 6 6 6 6 6 6 6 6 6 6 1 1 1 1 1 1 1 1 1 1 1 1 1 1 1 1 1 1 1 1 1 1 1 1
symmnumber: 1
zpe: 884939.8 jmol-1
zpe.correction: 0.337056 hartree
zpe.thermalcorrener: 0.354616 hartree
zpe.thermalcorrenthalpy: 0.355560 hartree
zpe.thermalcorrgfe: 0.294759 hartree
zpe.sumelectzpe: -620.960384 hartree
zpe.sumelectthermal: -620.942824 hartree
zpe.sumelectthermalent: -620.941879 hartree
zpe.sumelectthermalfe: -621.002681 hartree
dipole: 0.1126 -1.2218 1.2115
dipole: 1.7243
quadrupole: -87.8712 -89.9583 -91.9473
quadrupole: 1.8970 -1.6192 6.4543
quadrupole: 2.0544 -0.0327 -2.0217 1.8970 -1.6192 6.4543
hfenergy: -621.2974398 hartree
pointgroup: C01 [X(C12H24O2)]
dipole: 0.0239466 0.4579371 -0.4999231 debye
polarizability: 144.5165142|-1.2782473|132.501193|-1.7056861|-0.8834533|127.3390916 unknown
InChI: InChI=1S/C12H24O2/c1-10(2,3)8-12(7,9(13)14)11(4,5)6/h13H,8H2,1-7H3
charge 0 multiplicity 1
38 atoms
O  -0.55711 -1.880849 -1.150421
O  -0.793622 -2.301802 1.102891
C  -0.454259 0.059175 0.373605
C  -1.853967 0.746707 -0.100419
C  0.72196 0.607168 -0.511598
C  2.229973 0.298757 -0.186273
C  -0.234836 0.312898 1.888507
C  -3.067362 -0.062487 0.44143
C  -1.9862 0.825356 -1.648362
C  -1.945264 2.194992 0.460165
C  -0.606423 -1.459462 0.195041
C  3.025274 0.689532 -1.468439
C  2.782743 1.164484 0.981502
C  2.4927 -1.202346 0.106322
H  0.541465 0.250432 -1.540768
H  0.624864 1.711558 -0.53761
H  -1.139754 0.075207 2.471798
H  0.569434 -0.327509 2.283832
H  0.036015 1.365379 2.068981
H  -3.157352 -1.046166 -0.054556
H  -4.000447 0.496071 0.241011
H  -3.007704 -0.237816 1.529937
H  -1.272529 1.544146 -2.087714
H  -1.827393 -0.156874 -2.123101
H  -3.004818 1.174344 -1.903317
H  -2.830934 2.69461 0.024686
H  -2.060536 2.210236 1.55749
H  -1.059555 2.80176 0.196761
H  2.850603 1.748892 -1.738503
H  4.111865 0.554638 -1.310064
H  2.724355 0.063944 -2.329748
H  3.880498 1.042201 1.054435
H  2.575347 2.238466 0.809757
H  2.352439 0.885871 1.956582
H  3.577566 -1.377886 0.236419
H  2.143509 -1.83625 -0.729181
H  1.990353 -1.544233 1.029263
H  -0.686001 -2.868751 -1.165436
