program: Gaussian 09
title: 000219529
version: EM64L-G09RevD.01
frameworkgroup: C1[X(C9H17ClO)]
method: RPBEPBE
basis: SDD
operation: Freq
keyword: #p
keyword: freq=noraman
keyword: PBEPBE/SDD
title: #p freq=noraman PBEPBE/SDD
converged: YES YES NO NO
title: Mulliken charges:
elementType: Cl O C C C C C C C C C H H H H H H H H H H H H H H H H H
charge: -0.071514 -0.199557 0.188768 0.148272 0.212207 -0.658823 -0.690130 -0.723222 -0.730274 -0.707540 -0.711256 0.286495 0.273306 0.194494 0.243061 0.241299 0.225547 0.240859 0.219662 0.237355 0.218998 0.198162 0.251150 0.226483 0.204834 0.216381 0.214569 0.250415
chargesum: 0.00000
title: Mulliken charges with hydrogens summed into heavy atoms:
elementType: Cl O C C C C C C C C C
charge: -0.071514 -0.199557 0.188768 0.148272 0.212207 -0.099022 -0.011276 -0.037154 -0.075760 -0.025074 -0.029890
polarizability: 1.10208238e+02 -2.75766584e+00 1.08586256e+02 6.04121097e-01 4.19645137e+00 1.00480420e+02
1716.lowfreq: -11.9333 -6.2031 -0.0003 0.0016 0.0028 13.4329 49.0760 69.5876 77.9452
frequency: 48.9469 69.4807 77.9272 152.2108 158.4392 195.7300 201.0851 228.3781 249.2206 258.7367 271.3143 277.3374 300.7028 319.5142 354.5898 371.4428 382.2891 393.8930 426.7932 510.5603 531.9529 611.9206 672.3576 740.7990 796.6889 836.1601 900.1202 924.7122 931.4945 937.4528 942.8462 951.1668 983.2401 1014.1712 1023.2043 1039.2359 1090.9307 1147.3768 1191.7343 1215.1161 1224.4157 1241.5420 1267.5664 1277.1845 1366.5583 1371.6592 1377.6163 1396.6144 1402.1682 1437.3872 1454.8335 1459.7690 1463.1771 1471.2514 1474.1081 1475.5353 1480.5636 1486.2113 1497.0001 1508.7177 1584.7026 2975.6552 2978.8170 2982.3367 2985.0010 2992.5201 3061.8296 3063.8921 3068.3836 3076.1329 3079.9071 3086.2499 3090.7283 3094.7390 3096.1742 3107.0199 3117.1865 3156.2176
redmass: 4.7447 3.7198 7.0406 2.5145 1.2601 1.5502 1.4753 1.2694 1.3595 1.9751 2.3572 1.9036 2.8109 2.1955 1.3471 2.3012 2.2152 3.1908 2.8519 2.7402 3.4284 4.3237 5.3294 5.8218 3.2562 2.3142 1.6236 1.8496 1.8116 1.5904 1.4988 1.2046 1.8881 1.4732 1.3926 1.5645 1.3058 2.1372 2.6734 2.7569 3.0660 2.6620 2.0806 1.3592 1.1738 1.1894 1.1841 1.1884 1.2109 1.0871 1.0493 1.0544 1.0490 1.0523 1.0544 1.0571 1.0539 1.0599 1.0526 1.0601 9.4992 1.0348 1.0354 1.0355 1.0356 1.0382 1.0626 1.0975 1.0994 1.0987 1.0996 1.1008 1.0976 1.1000 1.0999 1.0996 1.0992 1.1053
irintensity: 2.8427 0.4781 1.7331 0.9039 0.0421 0.7011 0.1455 0.5863 0.7155 0.9981 2.2468 0.6554 1.5061 1.3436 0.2663 0.2794 0.0753 10.4798 2.4643 1.2159 3.7334 0.9166 27.5760 2.7245 2.1266 1.6902 14.8994 0.7330 25.6474 3.6567 7.1917 0.4813 61.3671 22.5827 2.6785 34.5407 2.8072 0.8150 4.9866 2.8407 1.2259 10.0235 3.8329 12.1672 13.6040 16.0039 31.2011 28.6079 15.7821 15.2175 1.3919 3.6914 0.9712 11.5379 7.6481 12.6628 2.4217 25.8581 18.6213 23.2597 79.2384 25.1284 18.2130 38.7102 27.9235 26.0065 11.9746 24.6665 57.8948 17.2911 35.0152 26.6053 25.7502 4.2873 29.0261 18.6442 15.9572 8.7414
temp: 298.150 k
press: 1.00000 atm
elementType: 17 8 6 6 6 6 6 6 6 6 6 1 1 1 1 1 1 1 1 1 1 1 1 1 1 1 1 1
symmnumber: 1
zpe: 630806.7 jmol-1
zpe.correction: 0.240262 hartree
zpe.thermalcorrener: 0.254328 hartree
zpe.thermalcorrenthalpy: 0.255272 hartree
zpe.thermalcorrgfe: 0.200534 hartree
zpe.sumelectzpe: -887.527717 hartree
zpe.sumelectthermal: -887.513651 hartree
zpe.sumelectthermalent: -887.512707 hartree
zpe.sumelectthermalfe: -887.567445 hartree
dipole: 0.3179 1.3238 3.5665
dipole: 3.8175
quadrupole: -73.9592 -77.6756 -79.7402
quadrupole: -4.8987 -0.3569 2.6452
quadrupole: 3.1658 -0.5506 -2.6152 -4.8987 -0.3569 2.6452
hfenergy: -887.7679786 hartree
pointgroup: C01 [X(C9H17Cl1O1)]
dipole: 0.0161597 0.4278981 -1.439578 debye
polarizability: 111.2164741|2.3340856|106.9145968|-0.1356752|-4.6615693|101.1438433 unknown
InChI: InChI=1S/C9H17ClO/c1-8(2,3)7(11)9(4,5)6-10/h6H2,1-5H3
charge 0 multiplicity 1
28 atoms
Cl 1.530324 -2.276426 0.337408
O  -0.332848 0.881535 1.673036
C  1.188972 0.515332 -0.179036
C  -1.527558 -0.134373 -0.158669
C  -0.216705 0.406126 0.510783
C  1.677626 -0.789888 -0.83667
C  2.231422 0.975233 0.872231
C  1.098021 1.600182 -1.30415
C  -1.406616 -0.894964 -1.501896
C  -2.207805 -1.081174 0.876732
C  -2.43943 1.12027 -0.363935
H  1.112903 -1.080174 -1.73032
H  2.752214 -0.725025 -1.068343
H  3.209177 1.137245 0.38044
H  2.352302 0.217569 1.664586
H  1.913271 1.911953 1.35605
H  2.086814 1.726927 -1.783427
H  0.810184 2.570902 -0.863646
H  0.366507 1.343064 -2.088939
H  -0.846242 -1.839249 -1.388345
H  -2.425661 -1.160663 -1.840397
H  -0.949484 -0.291796 -2.306648
H  -2.320895 -0.572766 1.848051
H  -1.605523 -1.995065 1.027724
H  -3.206874 -1.377917 0.507225
H  -3.429578 0.797113 -0.735409
H  -2.011943 1.824547 -1.102048
H  -2.577175 1.654479 0.591412
