program: Gaussian 09
title: 000219507
version: EM64L-G09RevD.01
frameworkgroup: C1[X(C12H24O)]
method: RPBEPBE
basis: SDD
operation: Freq
keyword: #pfreq=noraman
keyword: PBEPBE/SDD
title: #p freq=noraman PBEPBE/SDD
converged: NO YES NO NO
title: Mulliken charges:
elementType: O C C C C C C C C C C C C H H H H H H H H H H H H H H H H H H H H H H H H
charge: -0.223458 0.245007 0.293273 0.158207 0.163161 -0.806698 -0.776703 -0.738521 -0.755256 -0.749527 -0.746693 -0.722377 -0.713122 0.225323 0.207640 0.233259 0.210970 0.271165 0.211895 0.229325 0.211671 0.204202 0.213970 0.213703 0.228595 0.274616 0.194090 0.218401 0.236371 0.234075 0.212546 0.212666 0.222558 0.239864 0.202216 0.209628 0.253961
chargesum: 0.00000
title: Mulliken charges with hydrogens summed into heavy atoms:
elementType: O C C C C C C C C C C C C
charge: -0.223458 0.245007 0.293273 0.158207 0.163161 -0.140477 -0.082674 -0.093323 -0.098987 -0.062420 -0.063702 -0.047290 -0.047317
polarizability: 1.47114194e+02 4.30017760e-01 1.23655051e+02 1.05976501e+00 8.89935092e-01 1.22360694e+02
1716.lowfreq: -15.9382 -10.3376 -0.0005 -0.0004 0.0004 12.4515 33.0037 66.0881 95.2589
frequency: 32.4105 66.0459 95.2439 163.0891 182.1374 201.5474 219.2573 225.0412 236.1423 245.4373 258.1035 267.5156 270.0363 286.6787 305.5094 310.2843 325.8743 351.8341 358.5751 372.9112 378.8367 393.7012 402.5135 413.4739 443.9061 451.4077 526.5827 550.4925 599.7740 677.4941 748.3817 804.0276 828.7253 907.8732 922.3182 923.5354 926.2671 935.1990 940.0109 948.6815 949.8918 969.8181 996.1598 1008.9573 1023.3683 1029.6192 1036.6008 1140.9187 1156.1763 1180.3095 1190.2024 1212.7175 1221.5247 1227.2355 1233.9676 1243.3090 1365.8076 1368.1879 1376.4358 1376.9664 1377.0785 1396.1843 1400.9041 1409.4904 1450.8999 1457.0340 1461.5335 1465.5061 1466.3462 1467.8460 1470.0761 1473.6909 1475.4529 1483.8376 1487.5498 1490.8614 1496.3022 1503.0148 1506.5988 1514.2411 1561.1531 2970.1083 2975.3650 2975.5102 2981.0112 2981.8866 2984.4658 2991.7837 2995.4670 3059.8661 3061.2145 3067.0494 3068.2377 3068.5237 3069.8064 3072.2001 3076.0422 3079.2020 3083.6153 3084.9735 3098.9021 3104.2982 3112.8383 3117.9769 3121.6508
redmass: 3.6403 2.8574 2.7503 1.6370 1.8947 1.4053 1.3303 1.9911 1.1066 1.1504 1.4600 1.8997 2.0484 1.9569 1.2943 1.3494 2.1791 1.8495 2.3105 1.8029 2.3285 1.5628 2.4140 3.2863 2.6158 2.2535 2.8122 3.3114 3.7981 3.3266 4.7731 2.9062 2.4500 2.2949 1.8045 1.7216 1.6474 1.5441 1.4583 1.2110 1.2472 2.0989 1.3050 1.4226 1.3980 1.3625 1.5058 2.2975 2.6391 2.4054 2.6076 2.4397 3.1004 2.9569 3.2977 3.3610 1.1911 1.1804 1.1881 1.2009 1.1895 1.2072 1.2001 1.1971 1.0506 1.0503 1.0513 1.0499 1.0514 1.0487 1.0489 1.0540 1.0549 1.0598 1.0516 1.0603 1.0527 1.0547 1.0530 1.0512 8.2328 1.0348 1.0360 1.0343 1.0374 1.0371 1.0373 1.0390 1.0366 1.0996 1.0985 1.0984 1.0993 1.0991 1.0985 1.0981 1.0978 1.0974 1.0986 1.1001 1.0993 1.0986 1.0982 1.0983 1.0969
irintensity: 1.7068 0.6219 0.1127 1.2903 0.5605 0.1272 1.0972 0.4439 0.0678 0.0907 0.0049 0.2314 0.3927 0.3324 0.0849 0.0461 0.7294 0.5108 0.4285 0.5089 0.5817 0.0102 3.5985 4.3434 0.1695 0.5551 1.1221 2.6744 0.4054 0.6477 1.5328 0.9274 3.3859 5.4312 2.2589 2.7410 0.5730 6.1721 3.2197 0.7242 0.9634 120.9746 4.3134 5.6534 1.8520 1.0715 29.7528 8.1767 5.0166 14.0127 9.8465 14.4951 10.5671 10.0093 1.0656 0.6560 14.5368 12.0018 11.3244 34.0773 24.8070 31.1738 40.2000 11.4941 1.9305 1.6399 2.8857 2.8229 3.0383 1.1561 2.7955 12.8685 0.8566 24.0376 12.4284 4.5175 55.8940 16.2134 11.5742 2.7536 60.9636 33.2538 18.5896 26.9932 44.3387 22.5290 30.1554 37.5587 27.9062 5.8749 9.2683 85.0652 8.4984 2.6095 30.4822 60.0032 122.3040 6.1879 36.8145 13.1124 40.4272 16.4028 17.7108 11.8703 22.0161
temp: 298.150 k
press: 1.00000 atm
elementType: 8 6 6 6 6 6 6 6 6 6 6 6 6 1 1 1 1 1 1 1 1 1 1 1 1 1 1 1 1 1 1 1 1 1 1 1 1
symmnumber: 1
zpe: 872213.1 jmol-1
zpe.correction: 0.332208 hartree
zpe.thermalcorrener: 0.348973 hartree
zpe.thermalcorrenthalpy: 0.349917 hartree
zpe.thermalcorrgfe: 0.290663 hartree
zpe.sumelectzpe: -545.795774 hartree
zpe.sumelectthermal: -545.779010 hartree
zpe.sumelectthermalent: -545.778066 hartree
zpe.sumelectthermalfe: -545.837320 hartree
dipole: 0.0244 1.5122 2.0136
dipole: 2.5183
quadrupole: -80.8211 -84.9785 -88.2099
quadrupole: 1.2901 1.1041 -3.1508
quadrupole: 3.8488 -0.3087 -3.5401 1.2901 1.1041 -3.1508
hfenergy: -546.1279825 hartree
pointgroup: C01 [X(C12H24O1)]
dipole: -0.0253512 -0.7751345 -0.6165552 debye
polarizability: 146.9610714|-0.836164|124.018264|-2.0885766|0.5090375|122.1506037 unknown
InChI: InChI=1S/C12H24O/c1-10(2,3)9(13)12(7,8)11(4,5)6/h1-8H3
charge 0 multiplicity 1
37 atoms
O  0.655793 1.207398 1.289332
C  -0.660144 -0.624495 0.411312
C  -1.835994 0.273767 -0.246281
C  0.651843 0.241726 0.470358
C  2.002537 -0.027506 -0.290376
C  -0.528483 -1.973843 -0.345048
C  -0.999154 -0.974705 1.896268
C  -1.357397 0.900233 -1.587354
C  -3.086451 -0.602685 -0.545654
C  -2.289709 1.428443 0.690902
C  1.922448 -0.628106 -1.719619
C  2.809784 -0.996733 0.637719
C  2.780473 1.316417 -0.383234
H  -0.494724 -1.859869 -1.440311
H  0.371889 -2.527467 -0.026027
H  -1.397145 -2.611446 -0.104371
H  -1.994792 -1.448896 1.964572
H  -0.980144 -0.078057 2.533572
H  -0.259441 -1.694494 2.295641
H  -0.518941 1.603992 -1.429971
H  -2.18577 1.469738 -2.048906
H  -1.039479 0.131023 -2.31492
H  -3.906336 0.049519 -0.901416
H  -3.451038 -1.126812 0.356655
H  -2.897271 -1.354476 -1.331596
H  -1.442552 2.056461 1.009604
H  -3.019887 2.064207 0.154269
H  -2.789485 1.042392 1.597121
H  1.612137 -1.683456 -1.729712
H  1.240048 -0.052844 -2.36878
H  2.930431 -0.577921 -2.173345
H  2.308665 -1.973477 0.763684
H  3.804472 -1.182061 0.190629
H  2.955413 -0.547916 1.636298
H  3.798215 1.126398 -0.771122
H  2.274974 2.019491 -1.07131
H  2.85192 1.803463 0.601514
