program: Gaussian 09
title: 000219502
version: EM64L-G09RevD.01
frameworkgroup: C1[X(C11H24O)]
method: RPBEPBE
basis: SDD
operation: Freq
keyword: #pfreq=noraman
keyword: PBEPBE/SDD
title: #p freq=noraman PBEPBE/SDD
converged: YES YES NO NO
title: Mulliken charges:
elementType: O C C C C C C C C C C C H H H H H H H H H H H H H H H H H H H H H H H H
charge: -0.476310 0.356490 -0.074899 -0.102128 -0.491980 -0.378789 -0.766823 -0.736336 -0.745076 -0.733601 -0.351961 -0.699567 0.234993 0.183840 0.195117 0.228605 0.205687 0.169393 0.202648 0.206259 0.262659 0.212373 0.212488 0.214729 0.210674 0.245567 0.205297 0.209480 0.223729 0.229553 0.315080 0.195049 0.199301 0.210360 0.209822 0.218279
chargesum: 0.00000
title: Mulliken charges with hydrogens summed into heavy atoms:
elementType: O C C C C C C C C C C C
charge: -0.161230 0.356490 0.160094 0.081711 -0.068259 -0.003710 -0.095257 -0.096746 -0.083537 -0.070839 0.042390 -0.061106
polarizability: 1.36862842e+02 1.43024272e+00 1.21755880e+02 1.33875156e+00 2.68595849e-01 1.11255268e+02
1716.lowfreq: -10.1419 -0.0005 0.0004 0.0004 5.4826 15.1320 50.1519 59.9323 83.3531
frequency: 49.4915 59.8843 83.3521 96.2894 116.8139 142.9376 185.1292 191.9283 214.1814 232.2013 242.8407 259.9167 265.9057 279.2664 293.3785 307.7913 329.0905 342.1003 351.9408 382.2217 413.0345 445.5723 506.9520 522.0592 559.7451 673.9577 727.0062 771.0647 849.5739 860.5592 896.8416 903.9047 916.5102 923.9190 946.2851 948.0427 956.6142 982.8875 995.3851 1044.3843 1073.1988 1087.9802 1102.5858 1114.5947 1143.9607 1149.7585 1166.6725 1179.4150 1198.6642 1222.4203 1245.3490 1273.5204 1287.3220 1295.0865 1307.4755 1312.6032 1331.3263 1343.7075 1346.7039 1372.0936 1376.9394 1378.9871 1389.0996 1393.1885 1401.1123 1448.3401 1462.9936 1468.8695 1471.7111 1473.9863 1477.9808 1478.5051 1480.8205 1484.3925 1486.4147 1490.1758 1499.0082 1501.9004 2922.4234 2946.9412 2967.1409 2972.1146 2977.0132 2978.6527 2980.0412 2985.4244 2989.9508 2996.7338 2998.4226 3022.7433 3048.1152 3061.0594 3065.1587 3067.5868 3068.5904 3071.8907 3072.3874 3083.7496 3088.1114 3102.2708 3102.8984 3546.2837
redmass: 1.6554 2.7629 2.5604 2.5805 2.0225 2.3167 1.2824 2.7405 2.1280 1.2714 1.6751 1.1343 1.1345 1.9410 2.0881 2.5224 1.0625 2.6773 2.5801 2.3846 2.6599 2.8021 3.5426 2.7464 2.6284 2.9666 1.1251 1.3304 2.1958 2.4243 1.8421 1.7386 1.2771 1.1952 1.7955 1.4654 1.3531 1.5749 2.0828 2.6122 2.3653 1.6551 2.0249 2.1002 2.2231 2.1047 2.2600 1.8251 2.1085 1.4248 1.4115 1.4415 1.2694 1.1063 1.3406 1.3840 1.3783 1.3556 1.5148 1.3993 1.2604 1.2343 1.2206 1.2226 1.2006 1.0766 1.0704 1.0525 1.0539 1.0573 1.0446 1.0524 1.0482 1.0477 1.0779 1.0516 1.0528 1.0505 1.0818 1.0619 1.0593 1.0365 1.0365 1.0360 1.0389 1.0561 1.0403 1.0827 1.0946 1.1015 1.1012 1.0989 1.0988 1.0979 1.1007 1.0992 1.0968 1.0987 1.0994 1.0968 1.0986 1.0654
irintensity: 0.2506 0.2162 0.4627 0.2375 1.8326 0.0322 0.0345 0.0254 0.7346 0.9826 3.4822 0.6660 1.8742 1.1740 2.5540 6.4396 122.4653 12.3250 7.9353 0.9559 1.5814 5.5678 6.9541 3.4881 1.6472 2.3481 7.2534 4.5425 7.2997 17.5552 3.6829 3.2992 1.3397 3.3047 17.6601 27.5036 4.3870 10.4585 20.6291 2.9092 3.1668 23.2078 17.9249 2.7716 1.3743 8.8176 4.0731 12.9599 3.4052 1.1952 24.3478 7.6033 6.5629 1.5046 1.4390 1.7990 5.7060 5.6795 2.4920 7.1451 29.7884 8.8880 13.2956 26.6478 19.6377 5.0695 1.3975 9.4534 2.7351 2.6550 12.1029 3.8917 2.4777 9.9632 15.4399 7.5179 4.0027 25.4445 37.7913 19.7169 41.7446 36.3306 26.8020 31.4853 16.9692 51.3645 39.8108 14.3444 3.2043 12.4469 43.2188 10.2018 12.0260 111.5916 95.0816 57.0622 48.6544 37.9538 19.1978 43.3952 13.4762 3.1712
temp: 298.150 k
press: 1.00000 atm
elementType: 8 6 6 6 6 6 6 6 6 6 6 6 1 1 1 1 1 1 1 1 1 1 1 1 1 1 1 1 1 1 1 1 1 1 1 1
symmnumber: 1
zpe: 861942.5 jmol-1
zpe.correction: 0.328297 hartree
zpe.thermalcorrener: 0.344512 hartree
zpe.thermalcorrenthalpy: 0.345456 hartree
zpe.thermalcorrgfe: 0.286221 hartree
zpe.sumelectzpe: -507.755084 hartree
zpe.sumelectthermal: -507.738868 hartree
zpe.sumelectthermalent: -507.737924 hartree
zpe.sumelectthermalfe: -507.797159 hartree
dipole: 1.1872 1.0203 -0.9157
dipole: 1.8135
quadrupole: -78.4968 -79.4428 -80.6527
quadrupole: -0.5069 2.9085 2.3072
quadrupole: 1.0340 0.0879 -1.1219 -0.5069 2.9085 2.3072
hfenergy: -508.0833803 hartree
pointgroup: C01 [X(C11H24O1)]
dipole: -0.473686 -0.3806186 -0.373944 debye
polarizability: 136.8077906|1.5175241|121.7542041|-1.7152204|0.298891|111.3119953 unknown
InChI: InChI=1S/C11H24O/c1-6-7-8-11(12,9(2)3)10(4)5/h9-10,12H,6-8H2,1-5H3
charge 0 multiplicity 1
36 atoms
O  0.586842 0.27831 1.826128
C  0.633657 0.064258 0.340057
C  1.862706 0.950844 -0.068035
C  0.824159 -1.487453 0.125881
C  -0.698057 0.582753 -0.276249
C  -1.992123 -0.123552 0.196589
C  1.657796 2.44188 0.306018
C  2.284476 0.84278 -1.553726
C  2.185727 -1.993542 0.659937
C  0.562028 -2.024759 -1.305392
C  -3.262552 0.537987 -0.388342
C  -4.567592 -0.135665 0.0866
H  2.700149 0.579325 0.554593
H  0.041858 -1.952143 0.768649
H  -0.640532 0.522517 -1.381021
H  -0.789799 1.655459 -0.022449
H  -1.985382 -1.195306 -0.085162
H  -2.063104 -0.087795 1.305559
H  0.963265 2.948508 -0.390484
H  2.625178 2.975438 0.249866
H  1.265557 2.536347 1.33165
H  2.694288 -0.149253 -1.809373
H  1.441373 1.05412 -2.237737
H  3.073282 1.588687 -1.764857
H  3.020596 -1.691208 0.000854
H  2.38029 -1.595457 1.671108
H  2.190161 -3.098462 0.712601
H  0.618689 -3.129837 -1.297014
H  -0.438768 -1.747805 -1.681231
H  1.307519 -1.663165 -2.032501
H  -0.172191 -0.247663 2.186812
H  -3.209295 0.50704 -1.496002
H  -3.273113 1.611076 -0.108767
H  -4.662416 -0.084944 1.187866
H  -4.592174 -1.203324 -0.203013
H  -5.457397 0.353008 -0.351011
