program: Gaussian 09
title: 000219501
version: EM64L-G09RevD.01
frameworkgroup: C1[X(C14H30O)]
method: RPBEPBE
basis: SDD
operation: Freq
keyword: #pfreq=noraman
keyword: PBEPBE/SDD
title: #p freq=noraman PBEPBE/SDD
converged: NO YES NO NO
title: Mulliken charges:
elementType: O C C C C C C C C C C C C C C H H H H H H H H H H H H H H H H H H H H H H H H H H H H H H
charge: -0.458753 0.343743 -0.496466 -0.506674 -0.483223 -0.378319 -0.381932 -0.362675 -0.355158 -0.350965 -0.359558 -0.358919 -0.701232 -0.698876 -0.697580 0.190289 0.208218 0.225326 0.226094 0.206899 0.186571 0.220094 0.198274 0.200878 0.200914 0.218495 0.197074 0.184759 0.184808 0.318091 0.197597 0.197466 0.192189 0.192459 0.195142 0.197899 0.209572 0.209486 0.217199 0.212519 0.214408 0.209786 0.209134 0.215714 0.209233
chargesum: 0.00000
title: Mulliken charges with hydrogens summed into heavy atoms:
elementType: O C C C C C C C C C C C C C C
charge: -0.140661 0.343743 -0.097959 -0.055254 -0.089753 0.040050 0.019860 0.052894 0.014409 0.044098 0.025090 0.034122 -0.064975 -0.062164 -0.063499
polarizability: 1.82109555e+02 9.03624747e-01 1.55506360e+02 -2.16270837e-02 1.90517778e-01 1.32205343e+02
1716.lowfreq: -16.3051 -0.0005 -0.0005 -0.0005 7.2590 9.9339 28.8845 32.0839 44.1717
frequency: 27.5764 31.8903 43.9996 51.6476 54.9063 67.6839 79.2461 109.6375 112.7834 134.5463 139.8059 147.1271 178.0004 209.5968 216.9814 224.3371 228.9626 234.1519 278.6006 301.6428 313.9116 325.3477 344.0544 366.6323 407.6388 453.0983 482.2500 505.9214 600.3865 726.2148 728.1020 730.7261 748.2696 765.7812 781.3397 792.5431 831.0352 880.0335 893.6157 895.0112 897.8664 907.0417 942.2292 971.7037 977.8874 1017.3718 1025.7943 1036.0284 1058.4099 1070.5651 1076.0182 1081.8026 1086.6693 1097.9010 1101.0696 1107.6749 1130.3523 1154.1305 1168.0950 1201.7188 1209.9619 1217.3839 1242.6873 1254.7078 1258.6387 1263.1228 1273.8559 1280.1918 1287.2068 1289.1674 1290.9051 1291.6666 1311.8257 1324.8814 1335.1039 1346.2429 1350.5643 1355.7125 1359.1830 1375.6843 1387.3219 1388.2441 1389.3788 1453.2183 1461.6158 1463.1585 1464.9038 1467.6153 1470.1181 1470.8379 1475.7230 1476.0428 1477.1577 1478.1834 1480.6113 1483.0869 1486.8383 1487.9878 1493.3825 2936.4012 2943.7940 2948.2527 2958.2177 2958.3186 2965.2497 2967.8130 2970.7930 2970.9328 2971.3535 2972.7338 2974.5482 2988.7831 2995.0047 2998.1675 2998.9786 3001.0952 3007.8680 3019.5599 3022.9589 3040.2934 3044.0826 3052.8358 3066.7897 3067.7109 3068.0911 3070.4071 3070.5191 3070.9581 3530.4944
redmass: 3.2502 3.2820 1.6181 2.0676 2.2378 1.5899 2.6321 2.6427 3.0221 2.7415 2.5191 1.9590 2.2687 2.7810 3.0858 1.2364 1.1297 1.1239 2.9082 3.6365 3.0550 1.2559 1.9338 2.6142 2.8672 2.8890 2.6158 2.9759 3.0685 1.0786 1.0894 1.1143 1.3052 1.7052 1.4185 1.4267 1.3693 1.8701 1.7008 1.7464 1.8218 1.5006 1.3083 2.0311 1.4803 2.5689 2.9148 2.5320 2.4193 2.4923 2.3153 2.2854 2.1707 1.4257 1.8805 1.8781 1.8419 2.8269 2.0521 1.5463 1.4691 1.3704 1.3087 1.3375 1.2763 1.2953 1.2600 1.2143 1.0748 1.0665 1.1589 1.0955 1.3635 1.4049 1.4891 1.6003 1.5820 1.6559 1.5974 1.6574 1.2180 1.2190 1.2286 1.0798 1.0694 1.0753 1.0769 1.0660 1.0701 1.0728 1.0427 1.0430 1.0427 1.0668 1.0727 1.0664 1.0826 1.0867 1.0906 1.0643 1.0632 1.0593 1.0588 1.0582 1.0591 1.0593 1.0368 1.0368 1.0385 1.0584 1.0588 1.0972 1.0955 1.0923 1.0669 1.0959 1.0946 1.1025 1.1023 1.1032 1.1032 1.1019 1.1007 1.1007 1.1006 1.0993 1.0994 1.0992 1.0654
irintensity: 0.0065 0.0173 0.0183 0.0636 0.0376 0.0162 0.2341 0.1709 0.7145 0.6317 0.1841 0.0748 2.2488 0.4219 0.0224 0.0218 0.0036 0.0392 0.6615 3.4144 1.6622 75.3637 84.5576 16.6146 1.2357 3.8899 1.8509 6.7562 3.1784 7.9719 12.1814 5.6034 2.1963 6.5369 0.7332 0.2072 1.1283 10.7762 9.8248 8.0045 10.4268 6.2492 12.7381 8.6168 14.0341 0.1910 2.3737 0.1513 1.3593 3.9462 0.9329 0.9092 9.0911 0.3416 13.2374 15.9002 29.1442 2.9071 7.4029 0.8479 2.8638 0.6278 8.1709 5.3586 8.0426 6.2414 6.5695 10.0586 0.7337 0.8922 3.5164 0.5886 9.1919 9.1635 10.4639 4.1906 0.9722 0.6501 1.3116 7.3713 10.8580 14.9483 10.3116 2.2396 0.1432 1.0081 0.5115 0.6257 1.6533 4.4140 12.0382 12.4862 12.3264 4.1831 7.2127 1.4028 58.7288 0.1917 0.5990 1.9135 24.5674 29.6755 28.1573 1.4011 22.5848 40.5652 39.6607 50.5286 14.6714 14.1962 141.9571 4.7599 1.8066 6.8227 24.9879 16.8415 19.6354 4.2356 13.0457 10.6983 112.7232 42.2797 96.7680 106.9586 90.3091 58.8696 40.1921 59.8735 3.9079
temp: 298.150 k
press: 1.00000 atm
elementType: 8 6 6 6 6 6 6 6 6 6 6 6 6 6 6 1 1 1 1 1 1 1 1 1 1 1 1 1 1 1 1 1 1 1 1 1 1 1 1 1 1 1 1 1 1
symmnumber: 1
zpe: 1081917.6 jmol-1
zpe.correction: 0.412081 hartree
zpe.thermalcorrener: 0.432787 hartree
zpe.thermalcorrenthalpy: 0.433732 hartree
zpe.thermalcorrgfe: 0.360962 hartree
zpe.sumelectzpe: -625.431895 hartree
zpe.sumelectthermal: -625.411188 hartree
zpe.sumelectthermalent: -625.410244 hartree
zpe.sumelectthermalfe: -625.483013 hartree
dipole: 0.1076 -0.3692 -1.5255
dipole: 1.5732
quadrupole: -99.6088 -93.8490 -103.1819
quadrupole: -0.1451 1.2535 1.1207
quadrupole: -0.7289 5.0309 -4.3020 -0.1451 1.2535 1.1207
hfenergy: -625.8439754 hartree
pointgroup: C01 [X(C14H30O1)]
dipole: 0.0388222 -0.133978 -0.6030287 debye
polarizability: 182.1164838|0.7789865|155.4825541|-0.2385029|0.6309358|132.2222205 unknown
InChI: InChI=1S/C14H30O/c1-4-7-10-13-14(15,11-8-5-2)12-9-6-3/h15H,4-13H2,1-3H3
charge 0 multiplicity 1
45 atoms
O  -0.345189 -1.498507 1.463823
C  -0.385284 -0.611466 0.262435
C  0.936361 -0.79404 -0.538839
C  -0.539537 0.800945 0.873099
C  -1.589533 -1.029159 -0.630758
C  2.226581 -0.426836 0.225281
C  -0.596868 1.959937 -0.145263
C  -2.974894 -0.928785 0.043083
C  3.5064 -0.860581 -0.524379
C  -0.749875 3.336122 0.543196
C  -4.091248 -1.603973 -0.785981
C  4.806575 -0.465719 0.212772
C  -0.800461 4.509241 -0.458871
C  -5.482914 -1.479903 -0.128721
C  6.082887 -0.902299 -0.538539
H  0.995995 -1.860145 -0.852654
H  0.878645 -0.206702 -1.477564
H  -1.454136 0.806762 1.495749
H  0.301792 0.963009 1.573163
H  -1.580404 -0.424045 -1.55979
H  -1.422062 -2.081263 -0.952767
H  2.198717 -0.900484 1.226528
H  2.26451 0.668311 0.395172
H  0.322805 1.970653 -0.765668
H  -1.445093 1.814747 -0.845554
H  -2.921807 -1.394639 1.047031
H  -3.241875 0.135423 0.203433
H  3.512983 -0.412378 -1.540748
H  3.491646 -1.961373 -0.67209
H  -0.246986 -2.434321 1.146986
H  -1.671375 3.332735 1.160482
H  0.093647 3.485059 1.247903
H  -3.842949 -2.676415 -0.926296
H  -4.119194 -1.157349 -1.801533
H  4.820935 0.633587 0.360758
H  4.799524 -0.914783 1.226802
H  -1.653559 4.40079 -1.155436
H  0.123344 4.551437 -1.066659
H  -0.908794 5.480204 0.058565
H  -5.487763 -1.944175 0.875493
H  -6.264653 -1.974173 -0.734568
H  -5.769786 -0.418173 -0.006811
H  6.127115 -0.442656 -1.544166
H  6.997177 -0.60707 0.008564
H  6.1083 -2.000552 -0.671563
