program: Gaussian 09
title: 000219500
version: EM64L-G09RevD.01
frameworkgroup: C1[X(C10H20O)]
method: RPBEPBE
basis: SDD
operation: Freq
keyword: #pfreq=noraman
keyword: PBEPBE/SDD
title: #p freq=noraman PBEPBE/SDD
converged: YES YES NO NO
title: Mulliken charges:
elementType: O C C C C C C C C C C H H H H H H H H H H H H H H H H H H H H
charge: -0.207223 0.203042 0.158279 0.161975 -0.384699 -0.738093 -0.723172 -0.724772 -0.719603 -0.708683 -0.714170 0.202002 0.223046 0.212347 0.218552 0.223298 0.197220 0.235124 0.224529 0.214013 0.222637 0.207998 0.216119 0.241614 0.230724 0.255088 0.207316 0.203021 0.218728 0.228616 0.215130
chargesum: 0.00000
title: Mulliken charges with hydrogens summed into heavy atoms:
elementType: O C C C C C C C C C C
charge: -0.207223 0.203042 0.158279 0.161975 0.040349 -0.083898 -0.066298 -0.080124 -0.031146 -0.043259 -0.051696
polarizability: 1.18287186e+02 1.04205673e+00 1.04601080e+02 -4.55804608e-01 4.12982332e-01 1.04349888e+02
1716.lowfreq: -18.8253 -15.1813 0.0008 0.0009 0.0011 14.8757 30.3991 72.5910 84.3728
frequency: 29.7813 72.5447 84.3529 160.7321 184.3821 203.1413 213.4347 221.2179 235.0441 245.5097 260.7362 278.9545 291.4984 303.2266 319.6220 356.9540 367.0915 388.0273 397.0016 442.9421 515.6788 531.9018 607.6680 734.5068 769.0021 792.8236 825.7053 902.2170 923.5055 933.9361 937.2933 947.4925 971.4122 997.2671 1011.0051 1017.2611 1034.6715 1049.1757 1067.8331 1166.6878 1189.8917 1202.5393 1207.7585 1228.0166 1242.4470 1293.8029 1321.8272 1365.7695 1370.2971 1377.6911 1392.2870 1396.2373 1403.4170 1450.6245 1453.3987 1462.2751 1463.7852 1468.2929 1474.5910 1474.9527 1476.6165 1481.6418 1484.3503 1490.9732 1492.8216 1502.3420 1575.7568 2977.1228 2978.6943 2979.3808 2980.2492 2982.8781 2984.6143 2990.3752 3047.8352 3064.6609 3066.8510 3068.7927 3070.7756 3076.3739 3084.4531 3085.3890 3089.2481 3091.3571 3099.7441 3105.9756 3110.5135
redmass: 4.6212 2.8364 2.2593 1.5571 1.1442 1.0415 2.2959 1.5493 1.7370 1.5279 1.1653 1.6431 2.1164 1.3010 2.6676 2.2445 2.4010 2.2703 3.2665 2.6936 2.7015 3.3663 3.8816 3.7976 1.8698 1.8437 2.0940 2.1809 1.7919 1.4703 1.5663 1.2035 1.7099 1.4790 1.4126 1.6216 1.5092 1.6510 2.2251 2.5355 2.7466 2.5960 2.3938 3.1422 2.5031 1.4601 1.4246 1.1804 1.1913 1.1916 1.2114 1.1972 1.2068 1.0554 1.0509 1.0577 1.0482 1.0497 1.0556 1.0488 1.0508 1.0466 1.0636 1.0595 1.0562 1.0659 9.0294 1.0343 1.0372 1.0366 1.0372 1.0616 1.0373 1.0397 1.0946 1.0978 1.0997 1.0995 1.0993 1.0983 1.0990 1.0989 1.1009 1.0997 1.0968 1.0981 1.0983
irintensity: 2.2512 0.1060 0.3341 0.2990 0.1137 0.0773 0.2736 0.2593 0.5204 0.1047 0.1000 0.3613 1.3333 0.1225 0.2802 0.1080 0.9320 0.1387 7.8073 0.6899 0.8548 2.6186 0.0181 0.8476 6.2211 3.1949 6.4590 5.4990 2.4894 7.0812 3.1403 0.3907 56.9067 19.3153 5.0166 16.7764 16.6712 18.5685 1.5345 1.1102 6.7574 3.3419 0.6674 5.6342 4.9966 0.8726 1.1108 12.9666 6.8345 30.9595 30.5716 25.9267 7.4176 5.2492 0.2873 3.1232 2.6126 7.3684 4.9763 12.0729 0.9484 17.7150 4.4900 28.1478 6.7662 27.7551 89.9505 28.2864 30.0884 9.4099 30.9036 29.5273 42.6147 33.6507 11.6729 24.6799 10.5840 74.8814 26.1580 58.2060 34.9826 32.6140 10.3419 49.8207 41.6421 24.1604 17.0685
temp: 298.150 k
press: 1.00000 atm
elementType: 8 6 6 6 6 6 6 6 6 6 6 1 1 1 1 1 1 1 1 1 1 1 1 1 1 1 1 1 1 1 1
symmnumber: 1
zpe: 726569.5 jmol-1
zpe.correction: 0.276736 hartree
zpe.thermalcorrener: 0.291230 hartree
zpe.thermalcorrenthalpy: 0.292174 hartree
zpe.thermalcorrgfe: 0.236932 hartree
zpe.sumelectzpe: -467.358964 hartree
zpe.sumelectthermal: -467.344470 hartree
zpe.sumelectthermalent: -467.343525 hartree
zpe.sumelectthermalfe: -467.398767 hartree
dipole: -0.0480 0.1512 -2.8263
dipole: 2.8307
quadrupole: -67.6806 -69.7823 -77.1975
quadrupole: -0.2924 -0.2992 0.8395
quadrupole: 3.8729 1.7712 -5.6441 -0.2924 -0.2992 0.8395
hfenergy: -467.6356996 hartree
pointgroup: C01 [X(C10H20O1)]
dipole: 0.06503 0.2321922 1.0872649 debye
polarizability: 118.1744092|-1.5018472|104.5400403|-0.7977181|-0.3689136|104.523704 unknown
InChI: InChI=1S/C10H20O/c1-7-10(5,6)8(11)9(2,3)4/h7H2,1-6H3
charge 0 multiplicity 1
31 atoms
O  -0.25375 -0.593712 -1.742889
C  1.203894 -0.484713 0.200469
C  -1.502841 0.149962 0.191174
C  -0.174054 -0.303055 -0.515509
C  1.781479 0.895518 0.679426
C  1.084183 -1.438614 1.427292
C  2.196836 -1.131801 -0.803593
C  -1.36794 1.015954 1.469603
C  -2.268002 -1.170676 0.538051
C  -2.349472 0.947135 -0.842676
C  1.784616 2.016308 -0.383186
H  2.821969 0.701026 1.010026
H  1.23432 1.238916 1.575028
H  0.41754 -1.049685 2.214509
H  2.086838 -1.572886 1.875613
H  0.717386 -2.435499 1.122052
H  3.183251 -1.25456 -0.318095
H  2.318104 -0.520984 -1.712545
H  1.838674 -2.122908 -1.131315
H  -2.383801 1.253444 1.838885
H  -0.860663 1.974641 1.261872
H  -0.834607 0.506917 2.289372
H  -3.261283 -0.917244 0.954014
H  -2.415519 -1.780285 -0.37068
H  -1.730243 -1.778654 1.286684
H  -2.468874 0.373941 -1.775626
H  -1.865464 1.90912 -1.095532
H  -3.347239 1.164957 -0.418777
H  0.759689 2.274219 -0.709672
H  2.35349 1.724674 -1.283487
H  2.247782 2.934145 0.023216
