program: Gaussian 09
title: 000219499
version: EM64L-G09RevD.01
frameworkgroup: C1[X(C12H26O)]
method: RPBEPBE
basis: SDD
operation: Freq
keyword: #pfreq=noraman
keyword: PBEPBE/SDD
title: #p freq=noraman PBEPBE/SDD
converged: YES YES NO NO
title: Mulliken charges:
elementType: O C C C C C C C C C C C C H H H H H H H H H H H H H H H H H H H H H H H H H H
charge: -0.468869 0.310278 -0.466137 -0.432408 -0.398981 -0.386198 -0.760283 -0.343029 -0.353425 -0.361388 -0.360163 -0.695141 -0.697289 0.232907 0.174236 0.206774 0.194487 0.201857 0.206424 0.233807 0.185816 0.234928 0.216236 0.201899 0.191041 0.186094 0.180436 0.190063 0.323681 0.196591 0.195276 0.192340 0.198456 0.216064 0.209830 0.210732 0.208326 0.214178 0.210555
chargesum: 0.00000
title: Mulliken charges with hydrogens summed into heavy atoms:
elementType: O C C C C C C C C C C C C
charge: -0.145188 0.310278 -0.058994 -0.031147 0.009299 0.033425 -0.107220 0.034106 0.017074 0.030478 0.030634 -0.058515 -0.064230
polarizability: 1.50657573e+02 1.35649610e+00 1.36731765e+02 -4.23531331e-01 -6.94742577e-02 1.17433894e+02
1716.lowfreq: -19.7207 -9.9529 0.0002 0.0005 0.0007 6.1449 23.5322 57.2246 67.0587
frequency: 23.2899 56.9122 66.8272 70.8546 83.4283 93.2102 111.0140 131.0394 144.6759 150.3453 191.1749 225.9644 226.9825 233.4636 243.6248 271.1399 278.0780 307.4379 331.2790 359.2866 396.8523 427.6452 480.9972 496.0401 523.5891 725.7515 726.7041 743.1571 750.4108 764.3441 819.7829 835.9165 875.4139 886.3295 901.6901 926.3813 946.1235 964.6615 1004.4025 1013.1108 1020.5557 1046.8074 1054.2991 1064.3058 1072.5870 1075.2658 1097.7107 1112.7443 1138.0036 1156.2558 1185.8061 1202.5612 1211.1904 1239.9924 1248.6930 1260.8986 1271.0925 1287.0030 1288.4296 1289.5949 1294.2652 1304.0468 1311.4718 1336.0554 1346.4356 1352.1996 1354.8457 1369.7802 1383.9448 1388.0586 1388.8015 1450.6409 1458.4587 1463.1036 1465.7347 1469.2917 1470.9718 1471.3988 1476.0974 1476.3014 1477.3066 1480.1787 1483.2643 1488.8882 1490.4490 2944.9919 2949.2893 2952.7908 2962.8522 2964.2833 2967.7770 2971.1038 2971.4561 2971.9066 2971.9973 2978.0270 2991.6689 2992.4385 3010.3207 3017.9280 3024.0674 3025.6343 3043.4651 3052.2218 3064.9103 3067.6861 3068.3998 3069.7666 3071.7603 3086.0950 3544.9939
redmass: 3.6620 2.1413 1.5477 1.9378 3.0177 3.2288 2.6750 2.0710 1.8440 2.1056 2.7958 1.1462 1.1369 2.8108 1.2755 2.2336 2.7000 1.2284 2.3319 2.8761 2.6952 2.9223 2.8153 2.9614 2.7912 1.1117 1.0717 1.4110 1.3182 1.9000 1.3472 1.3740 1.9251 1.8799 1.8155 1.5679 1.3629 1.2525 2.9723 3.5402 1.5858 1.7213 2.2454 2.2708 2.2299 2.3608 1.9559 2.2731 1.5899 2.0854 2.1644 1.5319 1.4988 1.3334 1.3653 1.3413 1.2698 1.0677 1.1746 1.0658 1.1827 1.3478 1.3596 1.5505 1.4908 1.6368 1.6156 1.7495 1.2329 1.2166 1.2182 1.0822 1.0685 1.0709 1.0681 1.0702 1.0617 1.0673 1.0428 1.0432 1.0648 1.0730 1.0741 1.0882 1.0941 1.0655 1.0593 1.0589 1.0621 1.0594 1.0594 1.0375 1.0524 1.0430 1.0400 1.0581 1.0977 1.0955 1.0972 1.0979 1.1000 1.1018 1.1025 1.1028 1.0972 1.1004 1.1007 1.0995 1.0993 1.0992 1.0657
irintensity: 0.0074 0.1802 0.0081 0.5016 0.3783 0.0398 0.3221 0.1885 0.1173 3.7303 0.5651 0.0309 0.0994 0.2303 0.0856 0.5092 7.5031 119.9956 6.3476 2.7588 2.4130 4.8924 6.4784 6.7262 4.1969 6.5426 11.6294 8.8069 0.9835 3.7771 1.8681 4.1011 19.3107 7.5087 10.9093 1.7488 0.9510 0.6306 5.3643 2.1583 1.1122 28.9724 5.1792 14.8555 1.7333 0.3835 7.3195 10.9167 48.5372 3.7907 10.8272 1.9860 2.4973 14.2874 6.9734 0.6983 1.8155 0.4216 2.6644 0.3599 1.5741 2.5731 19.4207 23.2517 0.8407 0.6191 0.2970 20.2541 19.5902 10.2007 12.7027 3.7826 5.5372 0.2154 0.1177 0.8096 0.8079 1.1001 11.6698 12.2857 7.9715 11.1895 2.3888 34.0368 5.8864 23.6935 11.9844 12.2725 2.8368 8.9504 61.3008 57.5432 36.4513 58.2893 21.6955 82.8462 0.3308 9.4747 4.5521 22.7371 5.0416 1.5928 100.4590 50.8005 38.1135 105.1494 84.5699 64.4673 54.4665 40.8093 5.6858
temp: 298.150 k
press: 1.00000 atm
elementType: 8 6 6 6 6 6 6 6 6 6 6 6 6 1 1 1 1 1 1 1 1 1 1 1 1 1 1 1 1 1 1 1 1 1 1 1 1 1 1
symmnumber: 1
zpe: 935018.9 jmol-1
zpe.correction: 0.356130 hartree
zpe.thermalcorrener: 0.373999 hartree
zpe.thermalcorrenthalpy: 0.374943 hartree
zpe.thermalcorrgfe: 0.309676 hartree
zpe.sumelectzpe: -546.986360 hartree
zpe.sumelectthermal: -546.968491 hartree
zpe.sumelectthermalent: -546.967546 hartree
zpe.sumelectthermalfe: -547.032813 hartree
dipole: 1.8218 -0.0322 0.4365
dipole: 1.8736
quadrupole: -87.1806 -84.4258 -85.1455
quadrupole: 4.5164 -1.7716 -0.2266
quadrupole: -1.5966 1.1581 0.4385 4.5164 -1.7716 -0.2266
hfenergy: -547.3424895 hartree
pointgroup: C01 [X(C12H26O1)]
dipole: 0.7177993 -0.0188401 0.1666449 debye
polarizability: 150.6614035|1.3110403|136.716618|-0.6184936|0.2962534|117.4452104 unknown
InChI: InChI=1S/C12H26O/c1-4-6-8-10-12(3,13)11-9-7-5-2/h13H,4-11H2,1-3H3
charge 0 multiplicity 1
39 atoms
O  -0.68841 2.63609 -1.063575
C  0.004862 1.88369 0.028814
C  1.120879 1.02161 -0.621454
C  -1.126147 1.053932 0.683079
C  1.89509 0.07291 0.32298
C  -1.783597 -0.005064 -0.229381
C  0.578848 2.904231 1.036731
C  3.000213 -0.712512 -0.419485
C  -3.034479 -0.64078 0.41753
C  3.78104 -1.689287 0.489387
C  -3.688919 -1.731279 -0.461722
C  4.886438 -2.456885 -0.267763
C  -4.944818 -2.354979 0.184512
H  0.662529 0.43237 -1.438983
H  1.849371 1.710593 -1.104361
H  -1.902269 1.773066 1.012977
H  -0.731055 0.570265 1.598783
H  2.355697 0.649146 1.150744
H  1.190842 -0.644191 0.791517
H  -2.059117 0.475623 -1.18733
H  -1.056171 -0.808222 -0.468443
H  -0.223208 3.581742 1.379004
H  1.010862 2.405646 1.923328
H  1.375733 3.516551 0.571176
H  2.545774 -1.27908 -1.259145
H  3.711588 0.005226 -0.879981
H  -2.763411 -1.080302 1.401314
H  -3.7802 0.154193 0.628199
H  -0.012562 3.19098 -1.531722
H  3.071669 -2.411261 0.943139
H  4.230526 -1.124496 1.331614
H  -2.944043 -2.526935 -0.669215
H  -3.955476 -1.292213 -1.44469
H  5.427415 -3.153452 0.398727
H  5.627517 -1.75872 -0.701036
H  4.458295 -3.047928 -1.099373
H  -4.698363 -2.827613 1.154293
H  -5.394024 -3.129336 -0.464489
H  -5.715624 -1.584332 0.374791
